program: Orca
programVersion: 5.0.2
elementType: N H C H C O C C O N H C H H H O H H S H C O C H H C H H C H N H H C O O H H
charge: 1
multiplicity: 1
keywords: wB97X-D3BJ Opt Freq def2-TZVPP def2/J RIJCOSX VeryTightSCF
keywords: PAL8 defgrid3 TightOpt
frequency: 0.00 0.00 0.00 0.00 0.00 0.00 24.09 32.79 47.01 50.74 64.16 68.46 73.50 96.76 110.26 126.35 135.01 155.68 188.04 214.91 225.87 246.29 279.88 288.89 321.51 324.16 327.87 348.58 357.19 382.50 426.58 457.13 472.29 509.13 528.92 555.08 567.71 582.46 611.42 628.91 659.83 672.98 692.39 706.65 715.77 725.66 768.47 791.39 804.05 819.00 858.72 877.12 884.24 906.11 960.66 994.03 1003.95 1039.73 1044.97 1067.16 1091.01 1116.01 1147.44 1167.03 1175.36 1196.17 1205.14 1246.70 1256.63 1261.70 1272.37 1289.70 1313.92 1329.29 1340.76 1343.48 1357.08 1382.64 1412.18 1432.59 1435.87 1441.62 1454.09 1461.13 1477.37 1478.78 1481.65 1500.68 1533.72 1584.00 1628.64 1693.44 1708.42 1781.66 1836.88 1896.03 2756.60 3038.86 3054.22 3098.62 3103.22 3104.84 3110.65 3135.59 3152.67 3155.19 3158.62 3185.29 3503.46 3557.81 3570.17 3611.06 3795.87 3812.34
frequency: 24.09 32.79 47.01 50.74 64.16 68.46 73.50 96.76 110.26 126.35 135.01 155.68 188.04 214.91 225.87 246.29 279.88 288.89 321.51 324.16 327.87 348.58 357.19 382.50 426.58 457.13 472.29 509.13 528.92 555.08 567.71 582.46 611.42 628.91 659.83 672.98 692.39 706.65 715.77 725.66 768.47 791.39 804.05 819.00 858.72 877.12 884.24 906.11 960.66 994.03 1003.95 1039.73 1044.97 1067.16 1091.01 1116.01 1147.44 1167.03 1175.36 1196.17 1205.14 1246.70 1256.63 1261.70 1272.37 1289.70 1313.92 1329.29 1340.76 1343.48 1357.08 1382.64 1412.18 1432.59 1435.87 1441.62 1454.09 1461.13 1477.37 1478.78 1481.65 1500.68 1533.72 1584.00 1628.64 1693.44 1708.42 1781.66 1836.88 1896.03 2756.60 3038.86 3054.22 3098.62 3103.22 3104.84 3110.65 3135.59 3152.67 3155.19 3158.62 3185.29 3503.46 3557.81 3570.17 3611.06 3795.87 3812.34
formula: C10H18N3O6S
InChI: InChI=1S/C10H18N3O6S/c11-5(10(18)19)1-2-7(14)13-6(4-20)9(17)12-3-8(15)16/h5-6,12-13,15,18,20H,1-4H2,11H3
38 atoms
N  0.288616 2.992949 1.845993
H  0.63219 3.149917 2.783614
C  0.800154 3.898165 0.850212
H  0.407383 3.675231 -0.138775
C  2.318972 3.879617 0.75871
O  3.06156 3.199864 1.423906
C  -0.063277 1.68783 1.666211
C  -0.670658 1.236485 0.324472
O  0.025189 0.883234 2.575193
N  -0.012516 -0.003972 -0.054882
H  -0.508135 1.972688 -0.458955
C  -2.185489 1.023985 0.467258
H  -0.495568 -0.849971 0.223358
H  -2.626492 1.897537 0.946414
H  -2.623634 0.940442 -0.527985
O  2.743173 4.75527 -0.157336
H  3.708967 4.769455 -0.140362
H  0.498454 4.923335 1.077792
S  -2.68685 -0.48837 1.321681
H  -2.093245 -0.220042 2.490826
C  1.31842 0.012898 -0.132366
O  1.921581 1.09186 -0.242185
C  2.060477 -1.283622 0.086745
H  2.112417 -1.372904 1.179194
H  1.454473 -2.12814 -0.243567
C  3.461279 -1.415406 -0.532184
H  3.375292 -1.699723 -1.580801
H  3.965722 -2.240121 -0.025691
C  4.391938 -0.197264 -0.526959
H  5.425218 -0.544908 -0.605491
N  4.293556 0.625701 0.720937
H  3.334684 1.048427 0.701275
H  4.427104 0.07211 1.564084
C  4.164495 0.709322 -1.738232
O  3.729707 0.325261 -2.779837
O  4.608512 1.959224 -1.506502
H  4.49133 2.468322 -2.320607
H  4.95563 1.400593 0.721012
totalener: -1406.23620725 hartree
nucrepener: 1929.37010355 hartree
electener: -3335.60631079 hartree
oneelecener: -5742.81950675 hartree
twoeener: 2407.21319596 hartree
kineticenergy: 1400.65808894 hartree
exchangeener: -105.324372487418 hartree
correlationener: -7.056487543559 hartree
xcener: -112.380860030978 hartree
temp: 298.15 k
press: 1.00 atm
thermalcorrenthalpy: 0.00094421 hartree
totalenthalpy: -1405.99000434 hartree
totalentropycorr: -0.06525705 hartree
gibbsenthalpy: -1406.05526139 hartree
gibbsminuselec: 0.26353746 hartree
chargesum: 1.0000000
charge: -0.158822 0.183014 -0.068818 0.115411 0.327665 -0.386406 0.152068 0.040572 -0.354665 -0.158602 0.123042 -0.165259 0.169763 0.123612 0.143659 -0.250691 0.232070 0.164070 -0.147386 0.138241 0.361000 -0.503318 -0.225070 0.144312 0.128762 -0.214788 0.136121 0.138767 0.012924 0.156200 -0.052112 0.248201 0.219237 0.295574 -0.250925 -0.299365 0.248930 0.233012
charge: 0.327411 -0.004504 -0.052702 0.034934 -0.432440 0.083469 -0.387855 -0.126756 0.087036 0.355108 0.026885 -0.229462 -0.035714 0.014158 0.016798 0.383042 -0.087243 0.042432 0.506419 -0.142004 -0.346640 0.112930 -0.001285 0.043395 0.044494 0.008909 0.045714 0.034375 -0.051862 0.047257 0.608435 -0.020753 0.044655 -0.441230 0.166179 0.357323 -0.074168 0.043262
qa: -0.1588 0.1830 -0.0688 0.1154 0.3277 -0.3864 0.1521 0.0406 -0.3547 -0.1586 0.1230 -0.1653 0.1698 0.1236 0.1437 -0.2507 0.2321 0.1641 -0.1474 0.1382 0.3610 -0.5033 -0.2251 0.1443 0.1288 -0.2148 0.1361 0.1388 0.0129 0.1562 -0.0521 0.2482 0.2192 0.2956 -0.2509 -0.2994 0.2489 0.2330
va: 3.1264 1.0219 3.8401 1.0205 4.2862 2.1107 4.3341 3.8984 2.1562 3.2996 1.0073 3.9660 1.0749 1.0074 0.9934 2.2402 1.0257 0.9965 2.1979 1.0249 4.0424 1.9871 3.9014 0.9986 1.0172 3.8889 1.0201 0.9987 3.8308 0.9972 3.6188 1.0496 0.9812 4.3616 2.2520 2.1936 1.0140 0.9912
dispcorr: -0.082748782 hartree
energy: -1406.324857389208
dipole: 3.96132 -0.95244 3.00888 -3.53556 3.61382 0.07826 0.47729 -0.56166 -0.08436
magnitude: 3.01108 au
magnitude: 7.65355 debye
zeropoint: 0.31087721 hartree
thermalvibcorrection: 0.01832465 hartree
thermalrotcorrection: 0.00141627 hartree
thermaltrasncorrection: 0.00141627 hartree
thermaltotal: -1405.99282299 hartree
thermalcorr: 0.02115719 hartree
nonthermalcorr: 0.31087721 hartree
totalcorr: 0.33203440 hartree
totalenthalpy: -1405.99187878 hartree
