program: Orca
programVersion: 5.0.2
elementType: N H C H C O C C O N H C H H H O H H S H C O C H H C H H C H N H H C O O H H
charge: 1
multiplicity: 1
keywords: wB97X-D3BJ Opt Freq def2-TZVPP def2/J RIJCOSX VeryTightSCF
keywords: PAL8 defgrid3 TightOpt
frequency: 0.00 0.00 0.00 0.00 0.00 0.00 21.70 26.61 35.40 52.98 63.22 68.48 82.50 90.58 104.32 132.26 166.12 181.23 198.49 202.50 205.17 236.15 248.74 257.66 293.46 304.73 322.39 352.45 375.42 400.70 419.84 458.44 483.68 520.69 531.85 568.61 587.90 595.72 631.57 653.36 662.86 664.62 684.73 695.93 711.75 732.85 746.30 782.58 813.58 862.53 867.57 898.79 917.61 945.28 971.07 1027.47 1029.23 1044.82 1055.71 1069.20 1116.19 1141.92 1167.17 1178.10 1183.92 1210.52 1212.25 1242.69 1260.01 1266.89 1268.12 1295.60 1313.49 1315.52 1320.79 1343.42 1369.33 1376.76 1418.04 1421.36 1435.07 1454.43 1471.74 1476.31 1480.24 1495.90 1500.95 1534.87 1550.35 1575.64 1627.45 1665.50 1723.81 1753.02 1850.59 1861.40 2749.53 3084.50 3085.43 3093.34 3110.16 3114.17 3122.35 3122.42 3129.87 3133.22 3160.01 3166.78 3344.38 3412.75 3570.14 3601.66 3786.77 3797.30
frequency: 21.70 26.61 35.40 52.98 63.22 68.48 82.50 90.58 104.32 132.26 166.12 181.23 198.49 202.50 205.17 236.15 248.74 257.66 293.46 304.73 322.39 352.45 375.42 400.70 419.84 458.44 483.68 520.69 531.85 568.61 587.90 595.72 631.57 653.36 662.86 664.62 684.73 695.93 711.75 732.85 746.30 782.58 813.58 862.53 867.57 898.79 917.61 945.28 971.07 1027.47 1029.23 1044.82 1055.71 1069.20 1116.19 1141.92 1167.17 1178.10 1183.92 1210.52 1212.25 1242.69 1260.01 1266.89 1268.12 1295.60 1313.49 1315.52 1320.79 1343.42 1369.33 1376.76 1418.04 1421.36 1435.07 1454.43 1471.74 1476.31 1480.24 1495.90 1500.95 1534.87 1550.35 1575.64 1627.45 1665.50 1723.81 1753.02 1850.59 1861.40 2749.53 3084.50 3085.43 3093.34 3110.16 3114.17 3122.35 3122.42 3129.87 3133.22 3160.01 3166.78 3344.38 3412.75 3570.14 3601.66 3786.77 3797.30
formula: C10H18N3O6S
InChI: InChI=1S/C10H18N3O6S/c11-5(10(18)19)1-2-7(14)13-6(4-20)9(17)12-3-8(15)16/h5-6,12-13,15,18,20H,1-4H2,11H3
38 atoms
N  -0.346788 3.177304 1.807195
H  -0.063412 3.574016 2.695949
C  -0.782375 4.147251 0.824022
H  -0.153152 4.13599 -0.069533
C  -0.675015 5.524513 1.453976
O  -0.260329 5.719256 2.564222
C  -0.169218 1.864553 1.642337
C  -0.658505 1.244087 0.325525
O  0.322348 1.161665 2.531393
N  0.040047 0.008553 0.071414
H  -0.453852 1.941377 -0.488207
C  -2.172929 0.989148 0.385458
H  -0.448791 -0.832524 0.343157
H  -2.695096 1.896692 0.682897
H  -2.526342 0.718427 -0.609962
O  -1.095773 6.467923 0.61318
H  -1.009989 7.328054 1.047583
H  -1.817771 3.997697 0.510771
S  -2.665763 -0.386569 1.451219
H  -2.186785 0.108326 2.599637
C  1.383829 -0.003268 0.018866
O  2.039049 1.036801 -0.042916
C  2.051303 -1.363886 0.077204
H  1.367934 -2.105999 0.496273
H  2.267409 -1.671503 -0.948825
C  3.359908 -1.335855 0.869357
H  4.084198 -0.681909 0.377637
H  3.78445 -2.339086 0.874598
C  3.19892 -0.896897 2.329476
H  2.349565 -1.408101 2.788556
N  2.973529 0.577239 2.461015
H  3.63771 0.93538 3.156819
H  3.111232 1.033239 1.549537
C  4.433716 -1.204189 3.17459
O  5.027983 -0.352661 3.782634
O  4.736563 -2.494698 3.160434
H  5.511692 -2.643553 3.721244
H  1.98927 0.805355 2.71181
totalener: -1406.25901162 hartree
nucrepener: 1823.19267710 hartree
electener: -3229.45168872 hartree
oneelecener: -5530.13473038 hartree
twoeener: 2300.68304166 hartree
kineticenergy: 1400.67042717 hartree
exchangeener: -105.332577914274 hartree
correlationener: -7.055904480104 hartree
xcener: -112.388482394378 hartree
temp: 298.15 k
press: 1.00 atm
thermalcorrenthalpy: 0.00094421 hartree
totalenthalpy: -1406.00935979 hartree
totalentropycorr: -0.06561222 hartree
gibbsenthalpy: -1406.07497201 hartree
gibbsminuselec: 0.26357615 hartree
chargesum: 1.0000000
charge: -0.142659 0.195574 -0.091510 0.143262 0.284056 -0.304973 0.210346 0.073948 -0.448926 -0.146651 0.134747 -0.167264 0.163217 0.119965 0.153185 -0.253210 0.248050 0.129820 -0.133569 0.118375 0.202352 -0.417684 -0.154873 0.105623 0.133000 -0.211554 0.128513 0.134161 0.014724 0.141637 -0.063179 0.220292 0.224133 0.305209 -0.298464 -0.245266 0.255350 0.240245
charge: 0.354110 -0.006170 -0.035882 0.036753 -0.434501 0.129151 -0.368632 -0.134158 0.073921 0.343971 0.038938 -0.230689 -0.038602 0.007926 0.019987 0.385085 -0.072244 0.030123 0.511828 -0.143244 -0.373181 0.074069 -0.001069 0.031897 0.046860 0.001377 0.036749 0.040784 -0.043979 0.047521 0.610183 0.022164 0.014031 -0.428739 0.140911 0.401310 -0.063365 -0.025194
qa: -0.1427 0.1956 -0.0915 0.1433 0.2841 -0.3050 0.2103 0.0739 -0.4489 -0.1467 0.1347 -0.1673 0.1632 0.1200 0.1532 -0.2532 0.2481 0.1298 -0.1336 0.1184 0.2024 -0.4177 -0.1549 0.1056 0.1330 -0.2116 0.1285 0.1342 0.0147 0.1416 -0.0632 0.2203 0.2241 0.3052 -0.2985 -0.2453 0.2553 0.2402
va: 3.1704 1.0377 3.8626 0.9972 4.3694 2.1888 4.2597 3.8037 2.0406 3.2087 1.0097 3.9547 1.0672 1.0115 0.9943 2.2450 1.0104 0.9956 2.1888 1.0264 4.2518 2.0815 3.8461 1.0165 1.0060 3.8821 1.0102 1.0233 3.8527 1.0121 3.5822 1.0162 1.0266 4.3273 2.1929 2.2666 1.0046 1.0531
dispcorr: -0.079919240 hartree
energy: -1406.344416405543
dipole: 1.61412 -0.60061 1.01350 -5.03926 4.13877 -0.90050 -5.24447 4.83503 -0.40945
magnitude: 1.41624 au
magnitude: 3.59979 debye
zeropoint: 0.31102340 hartree
thermalvibcorrection: 0.01831607 hartree
thermalrotcorrection: 0.00141627 hartree
thermaltrasncorrection: 0.00141627 hartree
thermaltotal: -1406.01224439 hartree
thermalcorr: 0.02114862 hartree
nonthermalcorr: 0.31102340 hartree
totalcorr: 0.33217202 hartree
totalenthalpy: -1406.01130018 hartree
