program: Orca
programVersion: 5.0.2
elementType: N H C H C O C C O N H C H H H O H H S H C O C H H C H H C H N H H C O O H H
charge: 1
multiplicity: 1
keywords: wB97X-D3BJ Opt Freq def2-TZVPP def2/J RIJCOSX VeryTightSCF
keywords: PAL8 defgrid3 TightOpt
frequency: 0.00 0.00 0.00 0.00 0.00 0.00 22.66 24.70 29.20 40.16 40.94 53.48 63.28 92.84 112.12 123.97 138.70 153.42 179.25 190.35 218.28 220.78 255.23 267.24 291.30 298.87 309.88 338.70 362.27 378.79 425.24 454.15 469.08 502.62 512.71 530.89 571.97 596.66 604.78 621.54 640.58 658.27 678.55 715.44 719.00 732.61 753.46 813.35 824.08 840.13 866.98 871.31 911.44 935.82 964.57 974.41 992.74 1022.31 1027.11 1055.37 1093.00 1120.04 1149.49 1162.41 1166.71 1200.55 1202.26 1214.36 1217.69 1273.38 1288.02 1292.99 1299.27 1331.74 1339.76 1368.70 1376.25 1393.14 1403.57 1408.85 1427.02 1455.46 1469.53 1478.80 1485.65 1494.33 1500.29 1529.96 1564.74 1589.86 1601.49 1696.74 1741.95 1778.76 1863.31 1882.07 2765.74 3046.19 3085.13 3107.53 3120.45 3128.34 3132.35 3134.63 3135.31 3159.43 3175.26 3197.04 3404.32 3554.71 3632.55 3685.14 3791.32 3797.23
frequency: 22.66 24.70 29.20 40.16 40.94 53.48 63.28 92.84 112.12 123.97 138.70 153.42 179.25 190.35 218.28 220.78 255.23 267.24 291.30 298.87 309.88 338.70 362.27 378.79 425.24 454.15 469.08 502.62 512.71 530.89 571.97 596.66 604.78 621.54 640.58 658.27 678.55 715.44 719.00 732.61 753.46 813.35 824.08 840.13 866.98 871.31 911.44 935.82 964.57 974.41 992.74 1022.31 1027.11 1055.37 1093.00 1120.04 1149.49 1162.41 1166.71 1200.55 1202.26 1214.36 1217.69 1273.38 1288.02 1292.99 1299.27 1331.74 1339.76 1368.70 1376.25 1393.14 1403.57 1408.85 1427.02 1455.46 1469.53 1478.80 1485.65 1494.33 1500.29 1529.96 1564.74 1589.86 1601.49 1696.74 1741.95 1778.76 1863.31 1882.07 2765.74 3046.19 3085.13 3107.53 3120.45 3128.34 3132.35 3134.63 3135.31 3159.43 3175.26 3197.04 3404.32 3554.71 3632.55 3685.14 3791.32 3797.23
formula: C10H18N3O6S
InChI: InChI=1S/C10H18N3O6S/c11-5(10(18)19)1-2-7(14)13-6(4-20)9(17)12-3-8(15)16/h5-6,12-13,15,18,20H,1-4H2,11H3
38 atoms
N  -1.825336 2.50003 -1.954193
H  -1.759471 2.785868 -2.919814
C  -3.108371 2.682574 -1.307367
H  -2.99694 2.775355 -0.226577
C  -4.131911 1.580801 -1.559472
O  -5.31278 1.760112 -1.513574
C  -0.810775 1.703917 -1.563488
C  -0.833248 1.191189 -0.114842
O  0.104296 1.437573 -2.335358
N  0.006069 0.014626 0.013418
H  -1.844179 0.854684 0.115105
C  -0.467036 2.312303 0.865914
H  -0.455091 -0.875671 -0.052565
H  0.528525 2.688449 0.652628
H  -1.185797 3.123023 0.761958
O  -3.559214 0.381263 -1.793892
H  -4.276263 -0.253366 -1.929675
H  -3.552011 3.615149 -1.650864
S  -0.549166 1.629824 2.543589
H  -0.409008 2.794938 3.183996
C  1.354246 0.01951 -0.006612
O  2.032608 1.039948 -0.001836
C  2.017812 -1.347674 -0.079107
H  2.265188 -1.648935 0.941551
H  1.330832 -2.098733 -0.476372
C  3.307777 -1.286496 -0.89697
H  3.799162 -2.259198 -0.874532
H  3.991751 -0.567293 -0.444377
C  3.126875 -0.921861 -2.378403
H  4.09565 -0.998344 -2.872797
N  2.627125 0.476869 -2.569134
H  1.582066 0.556553 -2.546574
H  2.930454 1.06946 -1.788305
C  2.145276 -1.854824 -3.074129
O  1.063336 -1.508819 -3.4618
O  2.641586 -3.087477 -3.157421
H  1.994969 -3.657541 -3.597498
H  2.934757 0.867181 -3.456643
totalener: -1406.24165494 hartree
nucrepener: 1872.99903230 hartree
electener: -3279.24068725 hartree
oneelecener: -5630.40142667 hartree
twoeener: 2351.16073942 hartree
kineticenergy: 1400.66565332 hartree
exchangeener: -105.327589720614 hartree
correlationener: -7.053360366694 hartree
xcener: -112.380950087308 hartree
temp: 298.15 k
press: 1.00 atm
thermalcorrenthalpy: 0.00094421 hartree
totalenthalpy: -1405.99272322 hartree
totalentropycorr: -0.06590314 hartree
gibbsenthalpy: -1406.05862636 hartree
gibbsminuselec: 0.26366760 hartree
chargesum: 1.0000000
charge: -0.179822 0.194553 -0.089137 0.114617 0.265099 -0.257421 0.270157 0.093088 -0.419264 -0.198820 0.122994 -0.198728 0.180189 0.147894 0.122842 -0.280912 0.236088 0.162301 -0.146906 0.118134 0.240448 -0.422389 -0.165743 0.143820 0.098273 -0.214188 0.138683 0.139513 0.007011 0.162201 -0.062380 0.245161 0.227652 0.245395 -0.275152 -0.245493 0.252864 0.227377
charge: 0.342488 -0.001939 -0.039949 0.035199 -0.440335 0.148997 -0.344036 -0.138881 0.106128 0.348765 0.034463 -0.227278 -0.013171 0.000212 0.000214 0.350245 -0.081202 0.045912 0.480747 -0.142862 -0.382740 0.084839 -0.000837 0.047533 0.026889 0.004201 0.043072 0.036720 -0.052077 0.046047 0.609121 -0.017208 0.029269 -0.449601 0.140436 0.394916 -0.068574 0.044277
qa: -0.1798 0.1946 -0.0891 0.1146 0.2651 -0.2574 0.2702 0.0931 -0.4193 -0.1988 0.1230 -0.1987 0.1802 0.1479 0.1228 -0.2809 0.2361 0.1623 -0.1469 0.1181 0.2404 -0.4224 -0.1657 0.1438 0.0983 -0.2142 0.1387 0.1395 0.0070 0.1622 -0.0624 0.2452 0.2277 0.2454 -0.2752 -0.2455 0.2529 0.2274
va: 3.1738 1.0108 3.8375 1.0070 4.3134 2.2485 4.2581 3.7256 2.0739 3.2228 1.0291 3.9914 1.0127 1.0145 1.0021 2.1647 1.0199 1.0007 2.1643 1.0205 4.2117 2.0630 3.7987 1.0029 1.0194 3.9109 1.0135 1.0112 3.8254 0.9990 3.6416 1.0578 1.0124 4.4009 2.2125 2.2625 1.0063 0.9763
dispcorr: -0.081203937 hartree
energy: -1406.327637039550
dipole: 9.19235 -6.70834 2.48401 -0.18333 -0.81026 -0.99358 1.02155 -2.60767 -1.58612
magnitude: 3.11019 au
magnitude: 7.90547 debye
zeropoint: 0.31076117 hartree
thermalvibcorrection: 0.01880729 hartree
thermalrotcorrection: 0.00141627 hartree
thermaltrasncorrection: 0.00141627 hartree
thermaltotal: -1405.99523604 hartree
thermalcorr: 0.02163983 hartree
nonthermalcorr: 0.31076117 hartree
totalcorr: 0.33240100 hartree
totalenthalpy: -1405.99429183 hartree
