program: Orca
programVersion: 5.0.2
elementType: N H C H C O C C O N H C H H H O H H S H C O C H H C H H C H N H H C O O H H
charge: 1
multiplicity: 1
keywords: wB97X-D3BJ Opt Freq def2-TZVPP def2/J RIJCOSX VeryTightSCF
keywords: PAL8 defgrid3 TightOpt
frequency: 0.00 0.00 0.00 0.00 0.00 0.00 24.45 37.29 41.19 45.19 54.21 63.02 79.36 86.18 114.57 115.48 144.07 150.28 176.68 211.35 218.82 245.67 254.94 256.66 283.76 297.51 323.53 334.17 370.84 407.28 428.50 436.10 462.48 510.26 517.13 551.29 594.41 614.82 635.48 647.27 659.74 683.26 686.23 706.73 729.59 747.29 769.06 800.53 811.97 838.67 883.09 905.30 924.18 935.68 968.90 995.46 1007.46 1020.94 1051.07 1070.90 1110.85 1142.12 1150.60 1172.97 1181.09 1200.05 1215.24 1228.91 1246.66 1263.67 1276.82 1281.79 1315.64 1329.14 1339.08 1342.06 1366.54 1382.58 1402.54 1428.08 1444.26 1459.22 1470.13 1480.53 1489.82 1498.62 1512.02 1525.21 1532.04 1589.33 1625.43 1683.80 1713.24 1776.83 1832.43 1853.62 2760.83 2994.83 3087.64 3104.24 3108.62 3110.09 3122.97 3145.75 3156.42 3160.39 3168.36 3185.16 3472.80 3546.10 3584.23 3608.87 3789.62 3807.48
frequency: 24.45 37.29 41.19 45.19 54.21 63.02 79.36 86.18 114.57 115.48 144.07 150.28 176.68 211.35 218.82 245.67 254.94 256.66 283.76 297.51 323.53 334.17 370.84 407.28 428.50 436.10 462.48 510.26 517.13 551.29 594.41 614.82 635.48 647.27 659.74 683.26 686.23 706.73 729.59 747.29 769.06 800.53 811.97 838.67 883.09 905.30 924.18 935.68 968.90 995.46 1007.46 1020.94 1051.07 1070.90 1110.85 1142.12 1150.60 1172.97 1181.09 1200.05 1215.24 1228.91 1246.66 1263.67 1276.82 1281.79 1315.64 1329.14 1339.08 1342.06 1366.54 1382.58 1402.54 1428.08 1444.26 1459.22 1470.13 1480.53 1489.82 1498.62 1512.02 1525.21 1532.04 1589.33 1625.43 1683.80 1713.24 1776.83 1832.43 1853.62 2760.83 2994.83 3087.64 3104.24 3108.62 3110.09 3122.97 3145.75 3156.42 3160.39 3168.36 3185.16 3472.80 3546.10 3584.23 3608.87 3789.62 3807.48
formula: C10H18N3O6S
InChI: InChI=1S/C10H18N3O6S/c11-5(10(18)19)1-2-7(14)13-6(4-20)9(17)12-3-8(15)16/h5-6,12-13,15,18,20H,1-4H2,11H3
38 atoms
N  -0.017466 2.925423 2.096098
H  0.193276 3.051614 3.076801
C  0.583009 3.899014 1.21931
H  0.298814 3.741872 0.181567
C  2.102921 3.886201 1.298701
O  2.756132 3.178616 2.02829
C  -0.238774 1.613799 1.807006
C  -0.67248 1.20979 0.386948
O  -0.182606 0.75667 2.671207
N  0.018372 -0.020579 0.045101
H  -0.411737 1.969844 -0.345406
C  -2.190302 1.004643 0.339537
H  -0.478881 -0.87578 0.256678
H  -2.679373 1.910174 0.697294
H  -2.483523 0.841857 -0.695874
O  2.62473 4.786459 0.470138
H  3.58635 4.789117 0.567194
H  0.244492 4.903412 1.482796
S  -2.721786 -0.43106 1.32684
H  -3.684343 -0.818379 0.483287
C  1.353891 -0.011775 0.031219
O  1.982726 1.056497 -0.004289
C  2.098258 -1.318632 0.167025
H  1.516892 -2.15468 -0.222266
H  3.000188 -1.236758 -0.44095
C  2.458359 -1.61391 1.642882
H  3.269645 -2.345958 1.655667
H  1.608891 -2.076543 2.145235
C  2.830144 -0.400457 2.510083
H  1.933474 0.182039 2.730487
N  3.792755 0.524955 1.842438
H  4.71377 0.099963 1.750894
H  3.368263 0.810322 0.927243
C  3.476058 -0.835431 3.815371
O  4.604135 -0.539954 4.109219
O  2.652249 -1.575062 4.548518
H  3.104785 -1.832918 5.364456
H  3.889979 1.385153 2.385659
totalener: -1406.24885815 hartree
nucrepener: 1920.89144732 hartree
electener: -3327.14030547 hartree
oneelecener: -5725.78715085 hartree
twoeener: 2398.64684538 hartree
kineticenergy: 1400.68575090 hartree
exchangeener: -105.330322954378 hartree
correlationener: -7.055781442405 hartree
xcener: -112.386104396783 hartree
temp: 298.15 k
press: 1.00 atm
thermalcorrenthalpy: 0.00094421 hartree
totalenthalpy: -1406.00138632 hartree
totalentropycorr: -0.06552882 hartree
gibbsenthalpy: -1406.06691513 hartree
gibbsminuselec: 0.26440068 hartree
chargesum: 1.0000000
charge: -0.160076 0.183641 -0.070853 0.118399 0.343845 -0.404639 0.175547 0.046966 -0.357720 -0.149890 0.128751 -0.172427 0.169973 0.120613 0.141967 -0.238346 0.238252 0.162034 -0.129945 0.120556 0.274397 -0.433792 -0.214043 0.127740 0.133709 -0.216784 0.127516 0.140774 0.015289 0.163118 -0.044664 0.220863 0.217358 0.268444 -0.296628 -0.240948 0.249937 0.241067
charge: 0.329765 -0.003757 -0.047362 0.036057 -0.426285 0.080900 -0.388498 -0.132628 0.095519 0.355353 0.029450 -0.212975 -0.031248 0.012253 0.012700 0.395044 -0.078260 0.043746 0.498693 -0.146023 -0.356900 0.104697 0.001461 0.038608 0.036208 0.007856 0.035753 0.045292 -0.055431 0.038487 0.608037 0.040722 -0.027446 -0.441326 0.127252 0.401593 -0.066696 0.039390
qa: -0.1601 0.1836 -0.0709 0.1184 0.3438 -0.4046 0.1755 0.0470 -0.3577 -0.1499 0.1288 -0.1724 0.1700 0.1206 0.1420 -0.2383 0.2383 0.1620 -0.1299 0.1206 0.2744 -0.4338 -0.2140 0.1277 0.1337 -0.2168 0.1275 0.1408 0.0153 0.1631 -0.0447 0.2209 0.2174 0.2684 -0.2966 -0.2409 0.2499 0.2411
va: 3.1627 1.0218 3.8390 1.0190 4.2624 2.0802 4.2918 3.8849 2.1464 3.2857 1.0005 4.0125 1.0681 1.0050 0.9927 2.2626 1.0197 0.9977 2.2018 1.0153 4.1466 2.0805 3.8580 1.0138 1.0137 3.8583 1.0053 1.0157 3.7113 1.0624 3.6436 0.9910 1.0766 4.4263 2.2018 2.2596 1.0087 0.9962
dispcorr: -0.082741551 hartree
energy: -1406.337101381461
dipole: 0.21321 1.08569 1.29889 -2.49884 2.38655 -0.11229 -6.70395 5.63878 -1.06517
magnitude: 1.68354 au
magnitude: 4.27923 debye
zeropoint: 0.31144287 hartree
thermalvibcorrection: 0.01847845 hartree
thermalrotcorrection: 0.00141627 hartree
thermaltrasncorrection: 0.00141627 hartree
thermaltotal: -1406.00434751 hartree
thermalcorr: 0.02131099 hartree
nonthermalcorr: 0.31144287 hartree
totalcorr: 0.33275387 hartree
totalenthalpy: -1406.00340331 hartree
