program: Orca
programVersion: 5.0.2
elementType: N H C H C O C C O N H C H H H O H H S H C O C H H C H H C H N H H C O O H H
charge: 1
multiplicity: 1
keywords: wB97X-D3BJ Opt Freq def2-TZVPP def2/J RIJCOSX VeryTightSCF
keywords: PAL8 defgrid3 TightOpt
frequency: 0.00 0.00 0.00 0.00 0.00 0.00 23.71 30.38 37.74 44.71 45.94 59.82 84.59 88.98 121.30 128.03 164.84 178.61 186.46 222.16 247.08 265.28 282.02 285.44 294.89 342.14 361.49 370.75 388.83 403.19 423.93 447.25 489.42 502.58 525.62 555.05 578.17 596.89 627.80 644.29 648.68 652.96 671.38 685.36 701.52 718.53 737.71 779.14 808.91 841.38 868.85 886.99 900.86 923.54 955.94 994.10 1004.47 1018.61 1038.50 1068.63 1102.00 1124.50 1143.18 1169.47 1171.51 1192.26 1202.92 1218.93 1248.70 1276.03 1284.03 1293.76 1306.56 1326.88 1338.68 1342.42 1380.94 1381.47 1408.88 1427.53 1443.10 1452.41 1453.83 1475.86 1477.63 1489.94 1492.45 1544.64 1564.80 1594.04 1628.79 1692.32 1738.76 1779.92 1861.23 1865.71 2749.24 2975.13 3081.01 3104.35 3107.56 3112.44 3118.20 3130.99 3131.06 3166.59 3167.62 3190.52 3426.66 3552.84 3630.33 3649.94 3792.43 3797.06
frequency: 23.71 30.38 37.74 44.71 45.94 59.82 84.59 88.98 121.30 128.03 164.84 178.61 186.46 222.16 247.08 265.28 282.02 285.44 294.89 342.14 361.49 370.75 388.83 403.19 423.93 447.25 489.42 502.58 525.62 555.05 578.17 596.89 627.80 644.29 648.68 652.96 671.38 685.36 701.52 718.53 737.71 779.14 808.91 841.38 868.85 886.99 900.86 923.54 955.94 994.10 1004.47 1018.61 1038.50 1068.63 1102.00 1124.50 1143.18 1169.47 1171.51 1192.26 1202.92 1218.93 1248.70 1276.03 1284.03 1293.76 1306.56 1326.88 1338.68 1342.42 1380.94 1381.47 1408.88 1427.53 1443.10 1452.41 1453.83 1475.86 1477.63 1489.94 1492.45 1544.64 1564.80 1594.04 1628.79 1692.32 1738.76 1779.92 1861.23 1865.71 2749.24 2975.13 3081.01 3104.35 3107.56 3112.44 3118.20 3130.99 3131.06 3166.59 3167.62 3190.52 3426.66 3552.84 3630.33 3649.94 3792.43 3797.06
formula: C10H18N3O6S
InChI: InChI=1S/C10H18N3O6S/c11-5(10(18)19)1-2-7(14)13-6(4-20)9(17)12-3-8(15)16/h5-6,12-13,15,18,20H,1-4H2,11H3
38 atoms
N  -2.144896 1.246816 -2.662176
H  -2.138777 1.104345 -3.661576
C  -3.262073 1.972254 -2.108838
H  -4.191263 1.604981 -2.548351
C  -3.180827 3.471948 -2.360836
O  -2.256112 4.033987 -2.880655
C  -1.038663 0.795124 -2.049083
C  -0.854896 1.060166 -0.546918
O  -0.18665 0.173412 -2.680822
N  -0.001702 0.012305 -0.0048
H  -1.813505 0.954257 -0.035856
C  -0.371018 2.506732 -0.313452
H  -0.416357 -0.90427 -0.053138
H  -1.238212 3.164559 -0.313013
H  0.086217 2.569723 0.67014
O  -4.287171 4.07495 -1.918494
H  -4.214782 5.022842 -2.097451
H  -3.352734 1.809141 -1.035929
S  0.814187 3.182461 -1.505786
H  -0.094811 3.721841 -2.327708
C  1.355363 0.0215 -0.033026
O  2.024102 1.043045 -0.040687
C  2.033213 -1.342265 -0.091639
H  2.200325 -1.685583 0.932175
H  1.386689 -2.0785 -0.576252
C  3.383063 -1.227702 -0.798063
H  3.940481 -2.156157 -0.680572
H  3.962711 -0.435808 -0.323901
C  3.321489 -0.951723 -2.304925
H  4.345073 -0.801527 -2.65651
N  2.549052 0.281158 -2.660374
H  1.50874 0.134411 -2.64061
H  2.732539 1.038821 -1.995081
C  2.734144 -2.08296 -3.142092
O  1.925221 -1.903366 -4.00941
O  3.2588 -3.262375 -2.808583
H  2.900247 -3.936832 -3.402798
H  2.764751 0.58451 -3.60747
totalener: -1406.24228966 hartree
nucrepener: 1903.92499273 hartree
electener: -3310.16728239 hartree
oneelecener: -5692.35950150 hartree
twoeener: 2382.19221911 hartree
kineticenergy: 1400.68988154 hartree
exchangeener: -105.330705454406 hartree
correlationener: -7.057894406011 hartree
xcener: -112.388599860417 hartree
temp: 298.15 k
press: 1.00 atm
thermalcorrenthalpy: 0.00094421 hartree
totalenthalpy: -1405.99638271 hartree
totalentropycorr: -0.06506236 hartree
gibbsenthalpy: -1406.06144507 hartree
gibbsminuselec: 0.26476048 hartree
chargesum: 1.0000000
charge: -0.130928 0.200749 -0.122986 0.162742 0.299231 -0.312175 0.188635 0.049762 -0.393609 -0.164153 0.134119 -0.166732 0.171690 0.130680 0.152420 -0.253126 0.249216 0.125260 -0.179202 0.143101 0.180057 -0.398573 -0.150984 0.143789 0.098960 -0.197059 0.133229 0.146537 0.004849 0.152165 -0.067003 0.228537 0.232116 0.257009 -0.272607 -0.254638 0.251099 0.227825
charge: 0.357478 0.004368 -0.043391 0.043915 -0.452009 0.124041 -0.369071 -0.126554 0.110901 0.333832 0.031197 -0.226442 -0.012982 0.008318 0.018125 0.381577 -0.074290 0.034893 0.490804 -0.152571 -0.384680 0.093453 -0.002928 0.045185 0.027397 0.001133 0.040759 0.036026 -0.052381 0.049213 0.603798 -0.025158 0.023217 -0.445506 0.141892 0.389026 -0.069664 0.047080
qa: -0.1309 0.2007 -0.1230 0.1627 0.2992 -0.3122 0.1886 0.0498 -0.3936 -0.1642 0.1341 -0.1667 0.1717 0.1307 0.1524 -0.2531 0.2492 0.1253 -0.1792 0.1431 0.1801 -0.3986 -0.1510 0.1438 0.0990 -0.1971 0.1332 0.1465 0.0048 0.1522 -0.0670 0.2285 0.2321 0.2570 -0.2726 -0.2546 0.2511 0.2278
va: 3.2026 1.0094 3.8336 1.0006 4.2960 2.1623 4.3403 3.8105 2.0923 3.2212 0.9968 3.9616 1.0161 1.0004 1.0093 2.2377 1.0090 1.0116 2.1515 1.0255 4.2499 2.0802 3.8407 1.0005 1.0182 3.9119 1.0179 1.0093 3.8255 0.9969 3.6630 1.0856 1.0072 4.3929 2.2203 2.2372 1.0073 0.9812
dispcorr: -0.084276853 hartree
energy: -1406.331623465332
dipole: 2.48213 -2.50218 -0.02005 -4.70277 3.10380 -1.59897 5.00721 -4.99526 0.01196
magnitude: 1.59914 au
magnitude: 4.06468 debye
zeropoint: 0.31150648 hartree
thermalvibcorrection: 0.01814082 hartree
thermalrotcorrection: 0.00141627 hartree
thermaltrasncorrection: 0.00141627 hartree
thermaltotal: -1405.99914363 hartree
thermalcorr: 0.02097336 hartree
nonthermalcorr: 0.31150648 hartree
totalcorr: 0.33247984 hartree
totalenthalpy: -1405.99819942 hartree
