program: Orca
programVersion: 5.0.2
elementType: N H C H C O C C O N H C H H H O H H S H C O C H H C H H C H N H H C O O H H
charge: 1
multiplicity: 1
keywords: wB97X-D3BJ Opt Freq def2-TZVPP def2/J RIJCOSX VeryTightSCF
keywords: PAL8 defgrid3 TightOpt
frequency: 0.00 0.00 0.00 0.00 0.00 0.00 30.04 40.86 48.87 60.43 68.44 79.01 81.48 101.43 118.60 132.94 154.52 173.02 194.10 215.42 225.06 240.07 257.86 273.17 279.40 301.12 305.81 326.76 370.35 402.94 416.42 455.40 472.82 485.99 533.01 541.97 555.34 578.26 592.40 616.29 624.17 655.72 689.61 725.65 737.66 748.49 766.94 793.80 828.84 837.48 870.47 884.53 913.91 914.39 952.43 966.67 998.51 1007.14 1051.11 1091.50 1094.44 1116.20 1152.25 1165.69 1175.53 1204.58 1205.87 1226.90 1232.64 1288.59 1292.52 1295.20 1306.09 1314.19 1342.55 1348.61 1383.29 1388.02 1398.24 1409.69 1423.97 1433.96 1465.14 1472.51 1487.94 1496.44 1507.62 1516.67 1589.28 1596.89 1636.86 1679.15 1748.97 1780.62 1858.89 1873.21 2762.92 2854.30 3088.88 3092.07 3108.81 3114.15 3117.84 3139.16 3152.02 3153.54 3176.65 3199.09 3489.57 3564.50 3625.74 3673.16 3721.39 3839.67
frequency: 30.04 40.86 48.87 60.43 68.44 79.01 81.48 101.43 118.60 132.94 154.52 173.02 194.10 215.42 225.06 240.07 257.86 273.17 279.40 301.12 305.81 326.76 370.35 402.94 416.42 455.40 472.82 485.99 533.01 541.97 555.34 578.26 592.40 616.29 624.17 655.72 689.61 725.65 737.66 748.49 766.94 793.80 828.84 837.48 870.47 884.53 913.91 914.39 952.43 966.67 998.51 1007.14 1051.11 1091.50 1094.44 1116.20 1152.25 1165.69 1175.53 1204.58 1205.87 1226.90 1232.64 1288.59 1292.52 1295.20 1306.09 1314.19 1342.55 1348.61 1383.29 1388.02 1398.24 1409.69 1423.97 1433.96 1465.14 1472.51 1487.94 1496.44 1507.62 1516.67 1589.28 1596.89 1636.86 1679.15 1748.97 1780.62 1858.89 1873.21 2762.92 2854.30 3088.88 3092.07 3108.81 3114.15 3117.84 3139.16 3152.02 3153.54 3176.65 3199.09 3489.57 3564.50 3625.74 3673.16 3721.39 3839.67
formula: C10H18N3O6S
InChI: InChI=1S/C10H18N3O6S/c11-5(10(18)19)1-2-7(14)13-6(4-20)9(17)12-3-8(15)16/h5-6,12-13,15,18,20H,1-4H2,11H3
38 atoms
N  -2.296782 2.309912 -1.607414
H  -2.310437 2.760623 -2.510813
C  -3.542865 1.735192 -1.162703
H  -3.663114 1.812601 -0.078926
C  -3.664255 0.261312 -1.570953
O  -2.74874 -0.354016 -2.049338
C  -1.072166 1.82265 -1.289038
C  -0.899347 1.13739 0.066564
O  -0.116946 2.032018 -2.027727
N  0.000939 0.004733 -0.030217
H  -1.845742 0.721378 0.404763
C  -0.483465 2.214509 1.085851
H  -0.431343 -0.90336 -0.035271
H  0.424882 2.715504 0.766335
H  -1.281377 2.957464 1.136178
O  -4.83688 -0.323789 -1.339144
H  -5.486301 0.281831 -0.964366
H  -4.36206 2.304864 -1.604903
S  -0.281797 1.563994 2.754031
H  0.992556 1.183162 2.61652
C  1.356924 0.038299 -0.008332
O  2.014684 1.06858 0.010631
C  2.027116 -1.314354 -0.139012
H  1.313424 -2.130884 -0.054216
H  2.75254 -1.405568 0.669632
C  2.769948 -1.404045 -1.480856
H  3.028473 -2.445922 -1.667558
H  3.711171 -0.851899 -1.42535
C  2.00259 -0.903647 -2.709685
H  2.518361 -1.261292 -3.603332
N  1.99522 0.604003 -2.803102
H  2.806444 0.99234 -2.321757
H  2.00075 0.90873 -3.773942
C  0.570637 -1.43879 -2.780329
O  0.239401 -2.470649 -2.271849
O  -0.225252 -0.626525 -3.475879
H  -1.148872 -0.906819 -3.361992
H  1.152653 1.066208 -2.362216
totalener: -1406.23154738 hartree
nucrepener: 1965.64619658 hartree
electener: -3371.87774397 hartree
oneelecener: -5814.87958724 hartree
twoeener: 2443.00184327 hartree
kineticenergy: 1400.66137220 hartree
exchangeener: -105.329103239647 hartree
correlationener: -7.059352273154 hartree
xcener: -112.388455512801 hartree
temp: 298.15 k
press: 1.00 atm
thermalcorrenthalpy: 0.00094421 hartree
totalenthalpy: -1405.98760267 hartree
totalentropycorr: -0.06469073 hartree
gibbsenthalpy: -1406.05229340 hartree
gibbsminuselec: 0.26470582 hartree
chargesum: 1.0000000
charge: -0.162471 0.189916 -0.164070 0.143152 0.327618 -0.336994 0.222251 0.066226 -0.379578 -0.151713 0.112751 -0.168828 0.193990 0.160949 0.123135 -0.195412 0.227311 0.156927 -0.138271 0.119860 0.116553 -0.374792 -0.168576 0.123949 0.131197 -0.203911 0.134699 0.115804 0.041979 0.152161 -0.075841 0.227255 0.228527 0.245993 -0.262382 -0.282934 0.268684 0.234885
charge: 0.337671 -0.002515 -0.061031 0.034933 -0.431597 0.123956 -0.343300 -0.140998 0.144574 0.346378 0.031382 -0.237980 -0.012434 0.009885 0.012380 0.412186 -0.084975 0.040478 0.498391 -0.144466 -0.405865 0.074022 0.000688 0.027013 0.042231 0.006770 0.045505 0.032818 -0.045799 0.046584 0.601413 0.044250 0.044588 -0.453414 0.155625 0.378815 -0.083005 -0.045156
qa: -0.1625 0.1899 -0.1641 0.1432 0.3276 -0.3370 0.2223 0.0662 -0.3796 -0.1517 0.1128 -0.1688 0.1940 0.1609 0.1231 -0.1954 0.2273 0.1569 -0.1383 0.1199 0.1166 -0.3748 -0.1686 0.1239 0.1312 -0.2039 0.1347 0.1158 0.0420 0.1522 -0.0758 0.2273 0.2285 0.2460 -0.2624 -0.2829 0.2687 0.2349
va: 3.1746 1.0149 3.9122 0.9866 4.2384 2.1335 4.2490 3.7849 2.1255 3.1355 1.0153 3.9083 1.0069 1.0168 1.0069 2.2903 1.0163 0.9912 2.1724 1.0227 4.3227 2.1195 3.8070 1.0218 1.0178 3.9193 1.0107 1.0106 3.7734 0.9911 3.6329 0.9882 0.9769 4.4166 2.2355 2.2262 1.0133 1.0914
dispcorr: -0.085274799 hartree
energy: -1406.323530576578
dipole: 6.41509 -6.61038 -0.19529 1.01108 -0.23530 0.77579 -1.32681 -0.56525 -1.89206
magnitude: 2.05423 au
magnitude: 5.22145 debye
zeropoint: 0.31113238 hartree
thermalvibcorrection: 0.01831483 hartree
thermalrotcorrection: 0.00141627 hartree
thermaltrasncorrection: 0.00141627 hartree
thermaltotal: -1405.99125082 hartree
thermalcorr: 0.02114738 hartree
nonthermalcorr: 0.31113238 hartree
totalcorr: 0.33227976 hartree
totalenthalpy: -1405.99030661 hartree
