program: Orca
programVersion: 5.0.2
elementType: N H C H C O C C O N H C H H H O H H S H C O C H H C H H C H N H H C O O H H
charge: 1
multiplicity: 1
keywords: wB97X-D3BJ Opt Freq def2-TZVPP def2/J RIJCOSX VeryTightSCF
keywords: PAL8 defgrid3 TightOpt
frequency: 0.00 0.00 0.00 0.00 0.00 0.00 12.81 15.13 26.62 36.81 39.64 50.22 57.74 68.90 84.15 100.46 110.24 128.24 156.60 161.20 173.95 180.93 200.43 211.85 255.16 277.29 295.81 307.64 329.84 351.08 395.32 400.47 461.78 526.15 528.40 557.56 587.68 599.95 618.69 625.28 649.97 667.31 668.95 676.19 721.77 743.57 752.41 778.78 806.36 834.45 844.30 881.87 917.94 956.67 975.61 988.55 1030.62 1034.41 1061.74 1078.15 1085.14 1101.52 1141.07 1146.08 1176.00 1204.22 1210.40 1212.92 1218.71 1249.00 1269.53 1296.46 1307.07 1314.63 1325.73 1338.99 1363.42 1373.58 1384.56 1406.94 1418.93 1429.80 1466.84 1479.51 1485.06 1503.48 1506.37 1525.47 1530.40 1572.58 1650.59 1663.34 1761.93 1778.94 1860.25 1906.60 2752.12 3060.77 3073.35 3083.84 3106.25 3108.12 3123.80 3142.91 3146.89 3149.97 3167.90 3439.84 3519.71 3533.07 3596.52 3618.58 3777.52 3806.46
frequency: 12.81 15.13 26.62 36.81 39.64 50.22 57.74 68.90 84.15 100.46 110.24 128.24 156.60 161.20 173.95 180.93 200.43 211.85 255.16 277.29 295.81 307.64 329.84 351.08 395.32 400.47 461.78 526.15 528.40 557.56 587.68 599.95 618.69 625.28 649.97 667.31 668.95 676.19 721.77 743.57 752.41 778.78 806.36 834.45 844.30 881.87 917.94 956.67 975.61 988.55 1030.62 1034.41 1061.74 1078.15 1085.14 1101.52 1141.07 1146.08 1176.00 1204.22 1210.40 1212.92 1218.71 1249.00 1269.53 1296.46 1307.07 1314.63 1325.73 1338.99 1363.42 1373.58 1384.56 1406.94 1418.93 1429.80 1466.84 1479.51 1485.06 1503.48 1506.37 1525.47 1530.40 1572.58 1650.59 1663.34 1761.93 1778.94 1860.25 1906.60 2752.12 3060.77 3073.35 3083.84 3106.25 3108.12 3123.80 3142.91 3146.89 3149.97 3167.90 3439.84 3519.71 3533.07 3596.52 3618.58 3777.52 3806.46
formula: C10H18N3O6S
InChI: InChI=1S/C10H18N3O6S/c11-5(10(18)19)1-2-7(14)13-6(4-20)9(17)12-3-8(15)16/h5-6,12-13,15,18,20H,1-4H2,11H3
38 atoms
N  -3.059813 1.583414 0.663239
H  -4.012327 1.244099 0.623556
C  -2.812016 2.65218 1.604948
H  -2.153716 2.344137 2.422699
C  -4.132971 3.069426 2.213852
O  -5.194065 2.573931 1.946321
C  -2.161559 0.930959 -0.096335
C  -0.714112 1.430539 -0.116433
O  -2.454326 -0.031834 -0.78964
N  0.109302 0.232911 -0.157274
H  -0.451666 2.006394 0.769449
C  -0.458936 2.273505 -1.374616
H  -0.343007 -0.583964 -0.542116
H  0.593863 2.555401 -1.384669
H  -0.663996 1.670617 -2.258826
O  -3.963121 4.062383 3.094803
H  -4.83127 4.293112 3.451754
H  -2.366751 3.525431 1.123998
S  -1.381993 3.823347 -1.459835
H  -2.564228 3.293983 -1.796425
C  1.404282 0.234126 0.193026
O  2.002768 1.223759 0.588739
C  2.102407 -1.12524 0.106933
H  1.858301 -1.677319 1.019385
H  1.721045 -1.712113 -0.72856
C  3.607281 -0.899881 0.007561
H  3.863603 -0.112468 0.722915
H  3.869152 -0.525624 -0.987406
C  4.428916 -2.148025 0.317729
H  4.159736 -2.564549 1.28872
N  5.888216 -1.747398 0.397733
H  6.213794 -1.436126 -0.520215
H  6.005277 -0.980451 1.062105
C  4.252815 -3.234026 -0.736775
O  3.277138 -3.911533 -0.809116
O  5.310381 -3.285195 -1.571246
H  5.146044 -3.955743 -2.250894
H  6.487158 -2.524196 0.681097
totalener: -1406.22115059 hartree
nucrepener: 1708.07031600 hartree
electener: -3114.29146659 hartree
oneelecener: -5302.36569161 hartree
twoeener: 2188.07422502 hartree
kineticenergy: 1401.46086897 hartree
exchangeener: -105.461596187213 hartree
correlationener: -7.055346884817 hartree
xcener: -112.516943072030 hartree
temp: 298.15 k
press: 1.00 atm
thermalcorrenthalpy: 0.00094421 hartree
totalenthalpy: -1405.96279245 hartree
totalentropycorr: -0.07420256 hartree
gibbsenthalpy: -1406.03699500 hartree
gibbsminuselec: 0.25885892 hartree
chargesum: 1.0000000
charge: -0.161087 0.197322 -0.086864 0.127652 0.286010 -0.309469 0.193235 0.084369 -0.377134 -0.204880 0.103849 -0.178103 0.181043 0.126702 0.126143 -0.263237 0.239259 0.132473 -0.158222 0.118744 0.257261 -0.402274 -0.207087 0.122673 0.120153 -0.190269 0.121427 0.118989 -0.004959 0.170603 -0.040149 0.242604 0.244149 0.279769 -0.224074 -0.299663 0.264390 0.248653
charge: 0.335937 -0.008907 -0.054574 0.029286 -0.432306 0.122969 -0.393751 -0.125834 0.071374 0.348085 0.029918 -0.242987 -0.018975 0.010954 0.009704 0.372306 -0.081070 0.016367 0.500513 -0.145284 -0.390168 0.066865 0.000805 0.037918 0.030508 -0.010234 0.033151 0.036304 -0.041757 0.051466 0.616061 0.060153 0.061793 -0.438312 0.188128 0.353697 -0.061851 0.061745
qa: -0.1611 0.1973 -0.0869 0.1277 0.2860 -0.3095 0.1932 0.0844 -0.3771 -0.2049 0.1038 -0.1781 0.1810 0.1267 0.1261 -0.2632 0.2393 0.1325 -0.1582 0.1187 0.2573 -0.4023 -0.2071 0.1227 0.1202 -0.1903 0.1214 0.1190 -0.0050 0.1706 -0.0401 0.2426 0.2441 0.2798 -0.2241 -0.2997 0.2644 0.2487
va: 3.1231 1.0316 3.8185 0.9970 4.3621 2.1845 4.3438 3.7831 2.1489 3.2447 1.0360 3.9544 1.0444 1.0100 1.0150 2.2228 1.0175 1.0251 2.1725 1.0220 4.2472 2.1115 3.9108 1.0070 1.0244 3.9031 1.0468 1.0050 3.7483 0.9955 3.6662 0.9814 0.9683 4.3419 2.2777 2.1848 1.0011 0.9673
dispcorr: -0.074705547 hartree
energy: -1406.295854762170
dipole: 17.35717 -8.56619 8.79098 -5.26698 1.63200 -3.63498 0.77637 0.00197 0.77835
magnitude: 9.54465 au
magnitude: 24.26057 debye
zeropoint: 0.30955123 hartree
thermalvibcorrection: 0.01973233 hartree
thermalrotcorrection: 0.00141627 hartree
thermaltrasncorrection: 0.00141627 hartree
thermaltotal: -1405.96373866 hartree
thermalcorr: 0.02256487 hartree
nonthermalcorr: 0.30955123 hartree
totalcorr: 0.33211611 hartree
totalenthalpy: -1405.96279445 hartree
