program: Orca
programVersion: 5.0.2
elementType: N H C H C O C C O N H C H H H O H H S H C O C H H C H H C H N H H C O O H H
charge: 1
multiplicity: 1
keywords: wB97X-D3BJ Opt Freq def2-TZVPP def2/J RIJCOSX VeryTightSCF
keywords: PAL8 defgrid3 TightOpt
frequency: 0.00 0.00 0.00 0.00 0.00 0.00 18.85 30.09 40.84 48.60 55.90 61.17 66.35 102.96 105.98 116.37 161.54 177.94 186.33 208.19 223.83 234.11 257.40 275.00 279.14 305.22 316.78 345.97 367.56 391.47 425.59 436.50 468.46 491.66 523.67 534.47 555.01 575.93 597.47 608.47 627.47 635.36 679.28 702.91 727.14 730.84 774.84 798.91 807.19 853.17 878.83 893.98 899.95 930.84 974.42 988.86 1031.45 1036.03 1055.97 1110.10 1114.97 1121.41 1135.58 1149.38 1168.16 1202.00 1214.84 1232.47 1245.39 1275.19 1280.32 1301.10 1316.01 1323.14 1349.41 1363.85 1367.90 1381.17 1404.93 1421.81 1423.26 1426.77 1469.37 1477.82 1481.80 1496.21 1502.67 1534.38 1572.05 1582.45 1629.03 1672.02 1719.65 1749.44 1865.14 1894.79 2751.10 2960.55 3086.28 3091.16 3094.70 3111.09 3130.99 3135.41 3142.50 3155.95 3161.15 3197.00 3397.02 3516.19 3648.77 3675.94 3791.06 3803.10
frequency: 18.85 30.09 40.84 48.60 55.90 61.17 66.35 102.96 105.98 116.37 161.54 177.94 186.33 208.19 223.83 234.11 257.40 275.00 279.14 305.22 316.78 345.97 367.56 391.47 425.59 436.50 468.46 491.66 523.67 534.47 555.01 575.93 597.47 608.47 627.47 635.36 679.28 702.91 727.14 730.84 774.84 798.91 807.19 853.17 878.83 893.98 899.95 930.84 974.42 988.86 1031.45 1036.03 1055.97 1110.10 1114.97 1121.41 1135.58 1149.38 1168.16 1202.00 1214.84 1232.47 1245.39 1275.19 1280.32 1301.10 1316.01 1323.14 1349.41 1363.85 1367.90 1381.17 1404.93 1421.81 1423.26 1426.77 1469.37 1477.82 1481.80 1496.21 1502.67 1534.38 1572.05 1582.45 1629.03 1672.02 1719.65 1749.44 1865.14 1894.79 2751.10 2960.55 3086.28 3091.16 3094.70 3111.09 3130.99 3135.41 3142.50 3155.95 3161.15 3197.00 3397.02 3516.19 3648.77 3675.94 3791.06 3803.10
formula: C10H18N3O6S
InChI: InChI=1S/C10H18N3O6S/c11-5(10(18)19)1-2-7(14)13-6(4-20)9(17)12-3-8(15)16/h5-6,12-13,15,18,20H,1-4H2,11H3
38 atoms
N  -0.049323 3.342607 1.335137
H  0.322862 3.786002 2.160272
C  -0.307002 4.173807 0.16948
H  -1.281847 3.952202 -0.254622
C  0.7550 3.995772 -0.907575
O  0.527206 3.586315 -2.011965
C  -0.139546 2.013412 1.408424
C  -0.740267 1.236175 0.225616
O  0.216596 1.400015 2.423481
N  0.022663 0.011302 0.051037
H  -0.694896 1.821832 -0.691269
C  -2.190628 0.8530 0.544297
H  -0.450167 -0.867517 0.174232
H  -2.555971 0.160247 -0.214019
H  -2.22264 0.344251 1.509718
O  1.971575 4.351105 -0.469254
H  2.59886 4.188178 -1.186647
H  -0.307749 5.212644 0.497931
S  -3.325161 2.25075 0.672962
H  -3.510314 2.425248 -0.641083
C  1.365612 0.029584 0.002561
O  1.993451 1.086992 -0.038768
C  2.070472 -1.309768 0.076045
H  1.387619 -2.088315 0.423527
H  2.38214 -1.581252 -0.935195
C  3.308283 -1.251139 0.972864
H  4.058365 -0.588149 0.534531
H  3.751337 -2.244769 1.0280
C  3.034084 -0.811387 2.415911
H  2.135408 -1.301867 2.797861
N  2.803086 0.67124 2.525399
H  3.326784 1.054505 3.3115
H  3.076042 1.130646 1.649591
C  4.173861 -1.262877 3.330884
O  4.594336 -2.378587 3.329587
O  4.612771 -0.277491 4.136735
H  5.309548 -0.63039 4.708191
H  1.785772 0.912042 2.62664
totalener: -1406.24319380 hartree
nucrepener: 1874.77287083 hartree
electener: -3281.01606463 hartree
oneelecener: -5633.37395931 hartree
twoeener: 2352.35789469 hartree
kineticenergy: 1400.65901106 hartree
exchangeener: -105.326310648334 hartree
correlationener: -7.054628155841 hartree
xcener: -112.380938804174 hartree
temp: 298.15 k
press: 1.00 atm
thermalcorrenthalpy: 0.00094421 hartree
totalenthalpy: -1405.99494926 hartree
totalentropycorr: -0.06568160 hartree
gibbsenthalpy: -1406.06063086 hartree
gibbsminuselec: 0.26367726 hartree
chargesum: 1.0000000
charge: -0.124786 0.188968 -0.072766 0.114206 0.297106 -0.284675 0.236238 0.057794 -0.443312 -0.158412 0.128124 -0.206460 0.173326 0.141333 0.143873 -0.274193 0.239734 0.142661 -0.123954 0.115146 0.234453 -0.439663 -0.163900 0.101957 0.135714 -0.200433 0.121724 0.143190 0.002106 0.142197 -0.056578 0.215831 0.222124 0.294595 -0.247170 -0.287527 0.254302 0.237124
charge: 0.360887 -0.004200 -0.037160 0.019435 -0.452146 0.131205 -0.359765 -0.124226 0.083882 0.354230 0.034769 -0.242766 -0.015811 0.010281 0.017023 0.363723 -0.081130 0.040564 0.522166 -0.143472 -0.375434 0.075923 -0.000733 0.030266 0.047599 0.004316 0.035072 0.045387 -0.039228 0.049275 0.604324 0.019471 0.022044 -0.426656 0.170577 0.362181 -0.066277 -0.035598
qa: -0.1248 0.1890 -0.0728 0.1142 0.2971 -0.2847 0.2362 0.0578 -0.4433 -0.1584 0.1281 -0.2065 0.1733 0.1413 0.1439 -0.2742 0.2397 0.1427 -0.1240 0.1151 0.2345 -0.4397 -0.1639 0.1020 0.1357 -0.2004 0.1217 0.1432 0.0021 0.1422 -0.0566 0.2158 0.2221 0.2946 -0.2472 -0.2875 0.2543 0.2371
va: 3.2196 1.0158 3.7737 1.0620 4.2848 2.2091 4.2239 3.7756 2.0693 3.2563 1.0383 3.9546 1.0201 0.9938 1.0050 2.2025 1.0172 0.9987 2.1791 1.0180 4.2081 2.0667 3.8571 1.0164 1.0067 3.8974 1.0112 1.0240 3.8142 1.0112 3.5635 1.0087 1.0188 4.3283 2.2573 2.1884 1.0060 1.0713
dispcorr: -0.081555427 hartree
energy: -1406.329793878730
dipole: 1.17656 0.19738 1.37394 -5.05817 4.49697 -0.56121 -0.57472 1.81619 1.24147
magnitude: 1.93492 au
magnitude: 4.91818 debye
zeropoint: 0.31085183 hartree
thermalvibcorrection: 0.01856158 hartree
thermalrotcorrection: 0.00141627 hartree
thermaltrasncorrection: 0.00141627 hartree
thermaltotal: -1405.99754793 hartree
thermalcorr: 0.02139412 hartree
nonthermalcorr: 0.31085183 hartree
totalcorr: 0.33224595 hartree
totalenthalpy: -1405.99660372 hartree
