program: Orca
programVersion: 5.0.2
elementType: N H C H C O C C O N H C H H H O H H S H C O C H H C H H C H N H H C O O H H
charge: 1
multiplicity: 1
keywords: wB97X-D3BJ Opt Freq def2-TZVPP def2/J RIJCOSX VeryTightSCF
keywords: PAL8 defgrid3 TightOpt
frequency: 0.00 0.00 0.00 0.00 0.00 0.00 38.65 62.78 71.16 82.96 98.76 103.08 118.80 130.64 143.01 149.90 152.37 167.07 182.32 222.15 225.40 251.92 283.05 298.80 314.05 325.28 334.29 345.42 406.83 433.91 442.14 443.31 491.73 543.42 555.03 565.80 580.88 593.14 615.42 632.62 673.09 719.56 737.94 744.57 767.73 780.11 801.16 815.61 836.20 839.37 861.63 901.35 919.03 928.16 960.07 988.29 991.34 1020.22 1052.33 1084.63 1100.67 1129.15 1141.47 1158.92 1184.57 1231.31 1245.52 1258.16 1269.39 1291.51 1306.87 1313.14 1330.52 1333.24 1368.75 1382.79 1388.19 1390.84 1400.04 1424.90 1454.63 1467.94 1474.90 1481.94 1487.59 1498.80 1502.20 1506.58 1509.39 1591.21 1613.87 1709.71 1715.57 1777.71 1812.90 1819.64 2744.45 2758.58 3082.13 3098.32 3108.37 3117.45 3119.60 3135.15 3144.64 3158.21 3167.09 3172.30 3317.82 3482.66 3572.56 3591.12 3614.07 3653.11
frequency: 38.65 62.78 71.16 82.96 98.76 103.08 118.80 130.64 143.01 149.90 152.37 167.07 182.32 222.15 225.40 251.92 283.05 298.80 314.05 325.28 334.29 345.42 406.83 433.91 442.14 443.31 491.73 543.42 555.03 565.80 580.88 593.14 615.42 632.62 673.09 719.56 737.94 744.57 767.73 780.11 801.16 815.61 836.20 839.37 861.63 901.35 919.03 928.16 960.07 988.29 991.34 1020.22 1052.33 1084.63 1100.67 1129.15 1141.47 1158.92 1184.57 1231.31 1245.52 1258.16 1269.39 1291.51 1306.87 1313.14 1330.52 1333.24 1368.75 1382.79 1388.19 1390.84 1400.04 1424.90 1454.63 1467.94 1474.90 1481.94 1487.59 1498.80 1502.20 1506.58 1509.39 1591.21 1613.87 1709.71 1715.57 1777.71 1812.90 1819.64 2744.45 2758.58 3082.13 3098.32 3108.37 3117.45 3119.60 3135.15 3144.64 3158.21 3167.09 3172.30 3317.82 3482.66 3572.56 3591.12 3614.07 3653.11
formula: C10H18N3O6S
InChI: InChI=1S/C10H18N3O6S/c11-5(10(18)19)1-2-7(14)13-6(4-20)9(17)12-3-8(15)16/h5-6,12-13,15,18,20H,1-4H2,11H3
38 atoms
N  -0.228625 3.533287 0.293581
H  0.160013 4.233325 0.905431
C  -0.433298 3.886283 -1.098236
H  -1.391666 3.529241 -1.471666
C  0.666084 3.331427 -1.992497
O  0.463375 2.453284 -2.811997
C  -0.282452 2.289715 0.848815
C  -0.841981 1.151884 -0.023269
O  0.014659 2.079216 2.002815
N  0.01553 -0.020919 0.065652
H  -0.921406 1.438286 -1.071359
C  -2.231418 0.804527 0.523338
H  -0.468766 -0.90805 0.058026
H  -2.153571 0.620015 1.595498
H  -2.902434 1.650402 0.379027
O  1.842978 3.874843 -1.759711
H  2.529433 3.37848 -2.244905
H  -0.428738 4.97349 -1.171576
S  -2.949183 -0.695755 -0.184063
H  -3.070546 -0.250578 -1.441464
C  1.339064 0.007337 0.025376
O  1.988965 1.066978 -0.041845
C  2.079815 -1.312723 0.061328
H  2.683124 -1.300749 0.973821
H  1.394622 -2.154364 0.159804
C  2.970355 -1.554999 -1.174687
H  2.354258 -1.851904 -2.022832
H  3.624215 -2.401385 -0.954742
C  3.833704 -0.386025 -1.656247
H  4.639372 -0.763956 -2.289321
N  4.449023 0.363715 -0.513037
H  5.005566 1.13911 -0.875504
H  3.601427 0.775961 -0.014715
C  3.115655 0.715351 -2.44685
O  3.601857 1.826627 -2.491624
O  2.005258 0.333857 -3.0182
H  1.48363 1.139903 -3.2683
H  5.012978 -0.224746 0.09445
totalener: -1406.24360727 hartree
nucrepener: 1970.14243081 hartree
electener: -3376.38603808 hartree
oneelecener: -5823.92088250 hartree
twoeener: 2447.53484442 hartree
kineticenergy: 1400.64257908 hartree
exchangeener: -105.334055349999 hartree
correlationener: -7.064238097315 hartree
xcener: -112.398293447314 hartree
temp: 298.15 k
press: 1.00 atm
thermalcorrenthalpy: 0.00094421 hartree
totalenthalpy: -1406.00043528 hartree
totalentropycorr: -0.06339130 hartree
gibbsenthalpy: -1406.06382658 hartree
gibbsminuselec: 0.26428360 hartree
chargesum: 1.0000000
charge: -0.181117 0.195475 -0.091018 0.127372 0.357331 -0.387583 0.208204 -0.005204 -0.318780 -0.096681 0.105152 -0.164680 0.161458 0.158262 0.124105 -0.248943 0.250714 0.149563 -0.135945 0.105885 0.345953 -0.471234 -0.244443 0.133827 0.112500 -0.187731 0.132547 0.140162 -0.018515 0.164402 -0.072351 0.236043 0.236369 0.345491 -0.390813 -0.258207 0.262817 0.219613
charge: 0.330277 -0.008391 -0.044653 0.031087 -0.422301 0.130826 -0.394220 -0.123073 0.109414 0.372363 0.021516 -0.231233 -0.034055 0.023919 0.013368 0.401350 -0.112917 0.043085 0.504545 -0.145772 -0.351289 0.125752 0.001696 0.036032 0.038359 0.003546 0.042404 0.034992 -0.046015 0.047207 0.602767 0.041816 -0.029271 -0.448869 0.119500 0.404653 -0.125517 0.037102
qa: -0.1811 0.1955 -0.0910 0.1274 0.3573 -0.3876 0.2082 -0.0052 -0.3188 -0.0967 0.1052 -0.1647 0.1615 0.1583 0.1241 -0.2489 0.2507 0.1496 -0.1359 0.1059 0.3460 -0.4712 -0.2444 0.1338 0.1125 -0.1877 0.1325 0.1402 -0.0185 0.1644 -0.0724 0.2360 0.2364 0.3455 -0.3908 -0.2582 0.2628 0.2196
va: 3.1368 1.0133 3.8819 1.0035 4.1689 2.1087 4.3194 3.8714 2.2284 3.2761 1.0409 3.9359 1.0679 1.0102 1.0070 2.2694 1.0456 0.9975 2.1872 1.0211 4.0266 2.0150 3.9020 1.0072 1.0210 3.8149 1.0196 1.0005 3.8706 0.9932 3.5873 0.9912 1.0698 4.3100 2.1049 2.2667 1.0609 0.9811
dispcorr: -0.084623759 hartree
energy: -1406.335099957356
dipole: 5.38398 -2.35800 3.02597 -6.19522 4.76826 -1.42696 0.88136 -1.34106 -0.45970
magnitude: 3.37699 au
magnitude: 8.58363 debye
zeropoint: 0.31197384 hartree
thermalvibcorrection: 0.01731541 hartree
thermalrotcorrection: 0.00141627 hartree
thermaltrasncorrection: 0.00141627 hartree
thermaltotal: -1406.00297816 hartree
thermalcorr: 0.02014796 hartree
nonthermalcorr: 0.31197384 hartree
totalcorr: 0.33212179 hartree
totalenthalpy: -1406.00203395 hartree
