program: Orca
programVersion: 5.0.2
elementType: N H C H C O C C O N H C H H H O H H S H C O C H H C H H C H N H H C O O H H
charge: 1
multiplicity: 1
keywords: wB97X-D3BJ Opt Freq def2-TZVPP def2/J RIJCOSX VeryTightSCF
keywords: PAL8 defgrid3 TightOpt
frequency: 0.00 0.00 0.00 0.00 0.00 0.00 16.91 21.23 36.16 40.12 45.50 55.87 62.82 72.58 86.41 107.07 126.79 143.00 172.36 177.36 211.86 226.24 236.41 256.59 286.76 300.72 329.60 371.11 397.94 415.53 427.00 442.27 461.68 505.17 524.96 572.61 588.70 600.19 615.19 628.98 643.48 662.25 675.50 697.21 716.13 738.61 766.90 803.38 823.63 856.19 881.13 887.15 924.69 938.58 964.46 986.86 1001.51 1020.54 1058.97 1066.34 1121.34 1150.52 1155.09 1168.47 1179.99 1186.65 1213.57 1222.95 1244.47 1267.07 1281.99 1282.68 1308.38 1327.47 1336.18 1354.84 1378.08 1385.47 1404.12 1428.01 1439.42 1441.06 1460.19 1460.89 1486.03 1498.92 1502.04 1509.49 1537.00 1610.01 1646.88 1696.38 1716.95 1786.72 1858.84 1866.76 2501.74 2760.82 3082.27 3090.94 3108.92 3110.31 3123.94 3142.82 3144.11 3154.91 3159.11 3181.96 3500.16 3556.49 3599.29 3634.72 3784.65 3801.98
frequency: 16.91 21.23 36.16 40.12 45.50 55.87 62.82 72.58 86.41 107.07 126.79 143.00 172.36 177.36 211.86 226.24 236.41 256.59 286.76 300.72 329.60 371.11 397.94 415.53 427.00 442.27 461.68 505.17 524.96 572.61 588.70 600.19 615.19 628.98 643.48 662.25 675.50 697.21 716.13 738.61 766.90 803.38 823.63 856.19 881.13 887.15 924.69 938.58 964.46 986.86 1001.51 1020.54 1058.97 1066.34 1121.34 1150.52 1155.09 1168.47 1179.99 1186.65 1213.57 1222.95 1244.47 1267.07 1281.99 1282.68 1308.38 1327.47 1336.18 1354.84 1378.08 1385.47 1404.12 1428.01 1439.42 1441.06 1460.19 1460.89 1486.03 1498.92 1502.04 1509.49 1537.00 1610.01 1646.88 1696.38 1716.95 1786.72 1858.84 1866.76 2501.74 2760.82 3082.27 3090.94 3108.92 3110.31 3123.94 3142.82 3144.11 3154.91 3159.11 3181.96 3500.16 3556.49 3599.29 3634.72 3784.65 3801.98
formula: C10H18N3O6S
InChI: InChI=1S/C10H18N3O6S/c11-5(10(18)19)1-2-7(14)13-6(4-20)9(17)12-3-8(15)16/h5-6,12-13,15,18,20H,1-4H2,11H3
38 atoms
N  -2.668793 1.871063 1.395735
H  -3.505258 1.560762 1.86742
C  -2.490906 3.291423 1.238045
H  -2.661156 3.794699 2.191211
C  -3.426764 3.899052 0.200385
O  -4.10468 3.271513 -0.564487
C  -1.981522 0.862361 0.815707
C  -0.783349 1.201738 -0.082534
O  -2.285364 -0.307158 0.972199
N  0.057782 0.01633 -0.07842
H  -0.193535 2.032359 0.302943
C  -1.2955 1.507855 -1.494178
H  -0.45184 -0.852432 0.015296
H  -1.798756 0.621004 -1.8804
H  -2.022135 2.315882 -1.455725
O  -3.374373 5.236144 0.25208
H  -3.970757 5.588455 -0.42255
H  -1.468191 3.532447 0.947481
S  0.094632 1.959444 -2.569235
H  -0.616686 2.007805 -3.70073
C  1.380775 0.038143 -0.096292
O  2.032221 1.101182 -0.08718
C  2.097775 -1.297654 -0.171261
H  1.383465 -2.116425 -0.253246
H  2.647843 -1.280965 -1.116724
C  3.051206 -1.608891 0.998857
H  3.67842 -2.452912 0.701384
H  2.483776 -1.940146 1.868361
C  3.942784 -0.451777 1.470471
H  3.362324 0.233946 2.090221
N  4.441611 0.362661 0.327918
H  4.89852 -0.214569 -0.375443
H  3.544072 0.833638 -0.05344
C  5.14812 -0.921424 2.270737
O  6.273985 -0.621923 1.978052
O  4.784522 -1.67383 3.303594
H  5.575807 -1.941537 3.793462
H  5.13503 1.038489 0.646335
totalener: -1406.24318294 hartree
nucrepener: 1764.81651207 hartree
electener: -3171.05969501 hartree
oneelecener: -5414.49407142 hartree
twoeener: 2243.43437641 hartree
kineticenergy: 1400.64293255 hartree
exchangeener: -105.322753949593 hartree
correlationener: -7.050306637541 hartree
xcener: -112.373060587134 hartree
temp: 298.15 k
press: 1.00 atm
thermalcorrenthalpy: 0.00094421 hartree
totalenthalpy: -1405.99150702 hartree
totalentropycorr: -0.06693761 hartree
gibbsenthalpy: -1406.05844463 hartree
gibbsminuselec: 0.26112569 hartree
chargesum: 1.0000000
charge: -0.168561 0.197479 -0.107256 0.157696 0.274252 -0.292792 0.231488 0.038988 -0.359924 -0.142805 0.120438 -0.163015 0.191121 0.126183 0.120574 -0.257892 0.244317 0.115028 -0.161473 0.121188 0.328544 -0.433239 -0.244553 0.112799 0.136109 -0.188562 0.133277 0.133499 -0.033261 0.158859 -0.059867 0.214500 0.228047 0.279335 -0.289699 -0.246167 0.256003 0.229341
charge: 0.343639 0.000433 -0.051786 0.040163 -0.453822 0.126282 -0.375573 -0.124923 0.088728 0.376930 0.026575 -0.225667 -0.008730 0.012917 0.006556 0.372776 -0.079164 0.035319 0.471407 -0.143656 -0.354766 0.127088 -0.000101 0.039560 0.037721 0.003680 0.038710 0.043361 -0.062461 0.047883 0.597805 0.041757 -0.065764 -0.443893 0.134030 0.398068 -0.064140 0.043056
qa: -0.1686 0.1975 -0.1073 0.1577 0.2743 -0.2928 0.2315 0.0390 -0.3599 -0.1428 0.1204 -0.1630 0.1911 0.1262 0.1206 -0.2579 0.2443 0.1150 -0.1615 0.1212 0.3285 -0.4332 -0.2446 0.1128 0.1361 -0.1886 0.1333 0.1335 -0.0333 0.1589 -0.0599 0.2145 0.2280 0.2793 -0.2897 -0.2462 0.2560 0.2293
va: 3.1875 1.0114 3.8529 1.0014 4.3335 2.1934 4.3463 3.7887 2.1582 3.3297 1.0288 4.0077 1.0411 1.0150 1.0395 2.2247 1.0131 1.0107 2.1615 1.0175 4.0785 2.0831 3.8904 1.0214 1.0074 3.7999 1.0046 1.0158 3.8455 1.0021 3.5913 0.9932 1.0965 4.4064 2.2068 2.2513 1.0032 0.9870
dispcorr: -0.077244701 hartree
energy: -1406.325177699797
dipole: 5.96426 -2.71600 3.24826 -4.34278 3.52938 -0.81340 -0.56229 1.45821 0.89592
magnitude: 3.46634 au
magnitude: 8.81073 debye
zeropoint: 0.30990201 hartree
thermalvibcorrection: 0.01883694 hartree
thermalrotcorrection: 0.00141627 hartree
thermaltrasncorrection: 0.00141627 hartree
thermaltotal: -1405.99360621 hartree
thermalcorr: 0.02166948 hartree
nonthermalcorr: 0.30990201 hartree
totalcorr: 0.33157149 hartree
totalenthalpy: -1405.99266200 hartree
