program: Orca
programVersion: 5.0.2
elementType: N H C H C O C C O N H C H H H O H H S H C O C H H C H H C H N H H C O O H H
charge: 1
multiplicity: 1
keywords: wB97X-D3BJ Opt Freq def2-TZVPP def2/J RIJCOSX VeryTightSCF
keywords: PAL8 defgrid3 TightOpt
frequency: 0.00 0.00 0.00 0.00 0.00 0.00 21.31 27.14 33.58 46.20 61.45 63.16 81.28 85.67 105.22 129.22 164.16 179.78 190.92 202.42 203.02 213.05 239.18 251.06 264.11 291.51 324.15 353.54 375.18 401.10 418.72 449.58 477.27 520.21 531.03 565.55 587.36 593.39 626.48 649.61 660.56 663.55 682.69 698.29 710.64 733.93 750.57 773.35 848.33 863.03 892.06 903.49 918.74 944.63 965.83 1005.25 1028.53 1036.71 1059.71 1065.79 1115.08 1138.83 1152.58 1178.46 1180.62 1210.51 1211.89 1242.89 1253.80 1263.60 1270.66 1295.00 1313.50 1314.94 1319.60 1337.05 1368.07 1376.90 1418.41 1421.04 1434.49 1454.33 1472.74 1476.68 1491.99 1496.30 1499.51 1536.17 1550.81 1576.54 1627.12 1665.76 1728.20 1756.97 1851.01 1862.48 2765.84 3085.18 3085.51 3093.04 3100.82 3114.23 3114.42 3125.05 3130.08 3133.46 3159.82 3172.36 3356.70 3418.15 3572.39 3618.19 3787.37 3797.75
frequency: 21.31 27.14 33.58 46.20 61.45 63.16 81.28 85.67 105.22 129.22 164.16 179.78 190.92 202.42 203.02 213.05 239.18 251.06 264.11 291.51 324.15 353.54 375.18 401.10 418.72 449.58 477.27 520.21 531.03 565.55 587.36 593.39 626.48 649.61 660.56 663.55 682.69 698.29 710.64 733.93 750.57 773.35 848.33 863.03 892.06 903.49 918.74 944.63 965.83 1005.25 1028.53 1036.71 1059.71 1065.79 1115.08 1138.83 1152.58 1178.46 1180.62 1210.51 1211.89 1242.89 1253.80 1263.60 1270.66 1295.00 1313.50 1314.94 1319.60 1337.05 1368.07 1376.90 1418.41 1421.04 1434.49 1454.33 1472.74 1476.68 1491.99 1496.30 1499.51 1536.17 1550.81 1576.54 1627.12 1665.76 1728.20 1756.97 1851.01 1862.48 2765.84 3085.18 3085.51 3093.04 3100.82 3114.23 3114.42 3125.05 3130.08 3133.46 3159.82 3172.36 3356.70 3418.15 3572.39 3618.19 3787.37 3797.75
formula: C10H18N3O6S
InChI: InChI=1S/C10H18N3O6S/c11-5(10(18)19)1-2-7(14)13-6(4-20)9(17)12-3-8(15)16/h5-6,12-13,15,18,20H,1-4H2,11H3
38 atoms
N  -0.48116 3.072751 1.961185
H  -0.206446 3.429079 2.869402
C  -0.990368 4.073081 1.04718
H  -0.406311 4.122177 0.125031
C  -0.891515 5.423269 1.734486
O  -0.439092 5.580428 2.835655
C  -0.237594 1.782968 1.718497
C  -0.70337 1.213244 0.36728
O  0.305045 1.057056 2.555497
N  0.039304 0.015012 0.055314
H  -0.518697 1.95654 -0.409442
C  -2.202711 0.897321 0.394281
H  -0.418512 -0.857553 0.273138
H  -2.765637 1.796923 0.634705
H  -2.502233 0.556315 -0.595367
O  -1.369773 6.391531 0.95405
H  -1.290757 7.232813 1.42502
H  -2.035887 3.908887 0.777589
S  -2.560176 -0.40407 1.616394
H  -3.670493 -0.852024 1.021866
C  1.383501 0.050134 -0.000421
O  2.003999 1.111906 -0.01462
C  2.094503 -1.289569 -0.010081
H  1.433922 -2.075151 0.363722
H  2.327752 -1.533745 -1.049314
C  3.395886 -1.261839 0.793954
H  4.10469 -0.564684 0.340465
H  3.84913 -2.251661 0.754694
C  3.210604 -0.897211 2.271675
H  2.363653 -1.442402 2.69478
N  2.959911 0.564833 2.471343
H  3.611388 0.900601 3.189705
H  3.09731 1.067221 1.585534
C  4.440021 -1.227446 3.115448
O  5.019373 -0.397396 3.765919
O  4.757216 -2.513186 3.048156
H  5.528102 -2.677847 3.610312
H  1.967912 0.761319 2.723365
totalener: -1406.26245189 hartree
nucrepener: 1827.68512854 hartree
electener: -3233.94758044 hartree
oneelecener: -5539.06246214 hartree
twoeener: 2305.11488171 hartree
kineticenergy: 1401.50068066 hartree
exchangeener: -105.480249325288 hartree
correlationener: -7.065045233382 hartree
xcener: -112.545294558669 hartree
temp: 298.15 k
press: 1.00 atm
thermalcorrenthalpy: 0.00094421 hartree
totalenthalpy: -1406.00913890 hartree
totalentropycorr: -0.07052201 hartree
gibbsenthalpy: -1406.07966091 hartree
gibbsminuselec: 0.26256868 hartree
chargesum: 1.0000000
charge: -0.145048 0.195649 -0.087741 0.141752 0.281755 -0.304093 0.250309 0.066804 -0.440976 -0.160956 0.131731 -0.177123 0.164080 0.114473 0.149867 -0.254507 0.247587 0.128990 -0.143685 0.127131 0.203404 -0.416188 -0.153900 0.104803 0.132473 -0.212830 0.127843 0.133708 0.015806 0.143320 -0.063245 0.220142 0.223618 0.304917 -0.298495 -0.245882 0.254924 0.239584
charge: 0.354951 -0.005159 -0.036043 0.036101 -0.434393 0.129658 -0.367383 -0.137234 0.085739 0.343499 0.039056 -0.216278 -0.033340 0.004391 0.013486 0.383939 -0.072711 0.029525 0.495463 -0.141426 -0.373973 0.074269 -0.001336 0.031584 0.046430 0.001418 0.036561 0.040527 -0.043919 0.048169 0.610237 0.022373 0.015818 -0.428717 0.140753 0.400614 -0.063762 -0.028887
qa: -0.1450 0.1956 -0.0877 0.1418 0.2818 -0.3041 0.2503 0.0668 -0.4410 -0.1610 0.1317 -0.1771 0.1641 0.1145 0.1499 -0.2545 0.2476 0.1290 -0.1437 0.1271 0.2034 -0.4162 -0.1539 0.1048 0.1325 -0.2128 0.1278 0.1337 0.0158 0.1433 -0.0632 0.2201 0.2236 0.3049 -0.2985 -0.2459 0.2549 0.2396
va: 3.1808 1.0374 3.8607 0.9968 4.3718 2.1899 4.2188 3.8308 2.0556 3.2223 1.0069 4.0233 1.0611 1.0073 0.9946 2.2431 1.0109 0.9953 2.1804 1.0160 4.2579 2.0852 3.8430 1.0164 1.0062 3.8842 1.0102 1.0234 3.8509 1.0121 3.5832 1.0159 1.0246 4.3269 2.1929 2.2656 1.0049 1.0569
dispcorr: -0.079778873 hartree
energy: -1406.342229494171
dipole: 0.26431 0.32735 0.59166 -5.68451 4.57306 -1.11145 -7.31185 6.41747 -0.89438
magnitude: 1.54444 au
magnitude: 3.92566 debye
zeropoint: 0.31080394 hartree
thermalvibcorrection: 0.01851060 hartree
thermalrotcorrection: 0.00141627 hartree
thermaltrasncorrection: 0.00141627 hartree
thermaltotal: -1406.01008241 hartree
thermalcorr: 0.02134314 hartree
nonthermalcorr: 0.31080394 hartree
totalcorr: 0.33214709 hartree
totalenthalpy: -1406.00913820 hartree
