program: Orca
programVersion: 5.0.2
elementType: N H C H C O C C O N H C H H H O H H S H C O C H H C H H C H N H H C O O H H
charge: 1
multiplicity: 1
keywords: wB97X-D3BJ Opt Freq def2-TZVPP def2/J RIJCOSX VeryTightSCF
keywords: PAL8 defgrid3 TightOpt
frequency: 0.00 0.00 0.00 0.00 0.00 0.00 24.46 26.42 37.41 39.98 57.82 61.18 76.39 90.18 105.93 120.09 130.65 146.89 179.21 182.61 216.90 255.28 276.17 286.63 295.08 317.78 332.57 349.40 363.75 384.35 428.64 445.07 468.67 507.45 526.01 540.98 578.42 591.17 609.80 632.30 644.93 671.41 675.34 721.61 738.52 751.42 766.23 775.59 783.20 817.38 845.64 869.42 928.00 934.96 972.32 982.56 1004.77 1033.56 1047.33 1087.43 1129.43 1147.30 1150.38 1182.00 1184.64 1204.65 1214.20 1218.96 1229.65 1277.08 1294.59 1295.11 1317.82 1347.29 1362.76 1365.63 1381.85 1399.74 1402.49 1413.83 1437.10 1449.23 1470.59 1487.88 1498.39 1500.69 1508.52 1515.51 1527.61 1590.57 1650.33 1677.70 1722.10 1747.89 1853.23 1881.75 2753.68 2858.63 3070.25 3089.38 3103.70 3115.80 3124.84 3144.29 3145.67 3158.96 3164.49 3170.46 3491.10 3546.21 3639.67 3643.82 3782.39 3786.69
frequency: 24.46 26.42 37.41 39.98 57.82 61.18 76.39 90.18 105.93 120.09 130.65 146.89 179.21 182.61 216.90 255.28 276.17 286.63 295.08 317.78 332.57 349.40 363.75 384.35 428.64 445.07 468.67 507.45 526.01 540.98 578.42 591.17 609.80 632.30 644.93 671.41 675.34 721.61 738.52 751.42 766.23 775.59 783.20 817.38 845.64 869.42 928.00 934.96 972.32 982.56 1004.77 1033.56 1047.33 1087.43 1129.43 1147.30 1150.38 1182.00 1184.64 1204.65 1214.20 1218.96 1229.65 1277.08 1294.59 1295.11 1317.82 1347.29 1362.76 1365.63 1381.85 1399.74 1402.49 1413.83 1437.10 1449.23 1470.59 1487.88 1498.39 1500.69 1508.52 1515.51 1527.61 1590.57 1650.33 1677.70 1722.10 1747.89 1853.23 1881.75 2753.68 2858.63 3070.25 3089.38 3103.70 3115.80 3124.84 3144.29 3145.67 3158.96 3164.49 3170.46 3491.10 3546.21 3639.67 3643.82 3782.39 3786.69
formula: C10H18N3O6S
InChI: InChI=1S/C10H18N3O6S/c11-5(10(18)19)1-2-7(14)13-6(4-20)9(17)12-3-8(15)16/h5-6,12-13,15,18,20H,1-4H2,11H3
38 atoms
N  -2.230094 0.681437 2.490496
H  -2.170785 0.534024 3.486309
C  -3.50559 0.413483 1.872446
H  -4.252555 0.346937 2.663742
C  -3.634549 -0.873976 1.076859
O  -4.658766 -1.223373 0.570289
C  -1.026522 0.982712 1.959894
C  -0.767552 1.192036 0.450219
O  -0.037354 1.032825 2.682113
N  -0.005724 0.012942 0.039199
H  -0.054899 2.015299 0.437183
C  -1.866324 1.52896 -0.550791
H  -0.47209 -0.876187 0.131049
H  -1.401937 1.612392 -1.533041
H  -2.627483 0.755157 -0.637452
O  -2.486013 -1.596742 0.976989
H  -2.731081 -2.403149 0.500893
H  -3.832975 1.233707 1.23568
S  -2.731978 3.063969 -0.152451
H  -1.6676 3.870488 -0.23795
C  1.334959 0.032699 0.017173
O  1.987071 1.082207 -0.003048
C  2.055166 -1.295528 0.117053
H  1.459665 -2.114005 -0.2884
H  2.957919 -1.220756 -0.49056
C  2.404738 -1.613699 1.589629
H  3.186999 -2.376805 1.607547
H  1.539469 -2.040547 2.096403
C  2.824759 -0.401321 2.427642
H  1.95733 0.247144 2.594161
N  3.845715 0.436757 1.72591
H  4.648467 -0.115754 1.428984
H  3.349988 0.865922 0.896142
C  3.410361 -0.77064 3.779684
O  4.459036 -0.329844 4.169629
O  2.62336 -1.603958 4.450675
H  3.023505 -1.782754 5.314006
H  4.20189 1.150235 2.362593
totalener: -1406.23033876 hartree
nucrepener: 1858.03452632 hartree
electener: -3264.26486508 hartree
oneelecener: -5599.88727255 hartree
twoeener: 2335.62240748 hartree
kineticenergy: 1400.65008217 hartree
exchangeener: -105.321202081000 hartree
correlationener: -7.053369521059 hartree
xcener: -112.374571602059 hartree
temp: 298.15 k
press: 1.00 atm
thermalcorrenthalpy: 0.00094421 hartree
totalenthalpy: -1405.98107857 hartree
totalentropycorr: -0.06596512 hartree
gibbsenthalpy: -1406.04704369 hartree
gibbsminuselec: 0.26347676 hartree
chargesum: 1.0000000
charge: -0.146710 0.187851 -0.124512 0.150655 0.287008 -0.254838 0.230158 0.029431 -0.409410 -0.173611 0.130149 -0.135236 0.182904 0.144525 0.106607 -0.312059 0.240552 0.143805 -0.123727 0.108554 0.268690 -0.400236 -0.210985 0.117865 0.133863 -0.225686 0.131217 0.128932 0.012266 0.165583 -0.055242 0.217504 0.227304 0.284355 -0.297252 -0.246894 0.252911 0.233709
charge: 0.339259 -0.004195 -0.050797 0.049814 -0.441260 0.153054 -0.369092 -0.127924 0.063504 0.359594 0.043023 -0.246483 -0.024410 0.014903 0.007034 0.336566 -0.086240 0.023567 0.511145 -0.142972 -0.355513 0.120351 -0.001064 0.034863 0.034840 0.002810 0.035367 0.042219 -0.055685 0.038538 0.609036 0.046396 -0.032455 -0.439438 0.129401 0.398609 -0.065526 0.049162
qa: -0.1467 0.1879 -0.1245 0.1507 0.2870 -0.2548 0.2302 0.0294 -0.4094 -0.1736 0.1301 -0.1352 0.1829 0.1445 0.1066 -0.3121 0.2406 0.1438 -0.1237 0.1086 0.2687 -0.4002 -0.2110 0.1179 0.1339 -0.2257 0.1312 0.1289 0.0123 0.1656 -0.0552 0.2175 0.2273 0.2844 -0.2973 -0.2469 0.2529 0.2337
va: 3.1281 1.0178 3.8259 0.9975 4.2530 2.2581 4.2931 3.6836 2.0900 3.2583 1.0569 3.9806 1.0342 1.0014 1.0120 2.1342 1.0135 1.0276 2.1771 1.0225 4.1746 2.1064 3.8473 1.0174 1.0158 3.8584 1.0047 1.0193 3.6882 1.0851 3.6529 0.9892 1.0787 4.4172 2.2014 2.2519 1.0065 0.9866
dispcorr: -0.080910134 hartree
energy: -1406.316404141882
dipole: 7.49985 -4.49264 3.00722 -3.80628 2.21349 -1.59278 -3.48149 3.76338 0.28189
magnitude: 3.41464 au
magnitude: 8.67933 debye
zeropoint: 0.31111986 hartree
thermalvibcorrection: 0.01854591 hartree
thermalrotcorrection: 0.00141627 hartree
thermaltrasncorrection: 0.00141627 hartree
thermaltotal: -1405.98390583 hartree
thermalcorr: 0.02137845 hartree
nonthermalcorr: 0.31111986 hartree
totalcorr: 0.33249831 hartree
totalenthalpy: -1405.98296162 hartree
