program: Orca
programVersion: 5.0.2
elementType: N H C H C O C C O N H C H H H O H H S H C O C H H C H H C H N H H C O O H H
charge: 1
multiplicity: 1
keywords: wB97X-D3BJ Opt Freq def2-TZVPP def2/J RIJCOSX VeryTightSCF
keywords: PAL8 defgrid3 TightOpt
frequency: 0.00 0.00 0.00 0.00 0.00 0.00 19.87 29.51 39.54 45.25 46.57 63.39 67.10 70.55 90.38 113.92 143.02 172.25 190.40 217.12 238.09 257.72 267.56 290.64 294.87 305.17 348.42 360.82 383.91 406.15 429.24 447.86 475.78 508.08 530.34 544.59 575.00 589.83 629.78 636.34 642.05 658.86 681.61 684.31 728.63 738.31 758.40 766.84 837.73 846.17 874.97 884.62 895.67 939.20 967.23 996.58 1001.36 1021.12 1034.87 1061.16 1109.17 1143.66 1150.11 1161.82 1167.87 1188.04 1190.94 1208.11 1252.09 1274.77 1282.67 1296.56 1323.68 1331.26 1335.14 1341.57 1368.45 1393.09 1399.30 1419.29 1432.65 1440.37 1461.32 1483.80 1489.49 1493.38 1507.16 1541.53 1577.08 1595.54 1632.71 1655.92 1725.78 1757.14 1868.02 1890.63 2768.05 3095.19 3106.18 3106.78 3114.47 3121.14 3125.75 3129.94 3156.73 3163.31 3169.45 3191.22 3213.52 3554.89 3602.91 3633.02 3790.17 3799.02
frequency: 19.87 29.51 39.54 45.25 46.57 63.39 67.10 70.55 90.38 113.92 143.02 172.25 190.40 217.12 238.09 257.72 267.56 290.64 294.87 305.17 348.42 360.82 383.91 406.15 429.24 447.86 475.78 508.08 530.34 544.59 575.00 589.83 629.78 636.34 642.05 658.86 681.61 684.31 728.63 738.31 758.40 766.84 837.73 846.17 874.97 884.62 895.67 939.20 967.23 996.58 1001.36 1021.12 1034.87 1061.16 1109.17 1143.66 1150.11 1161.82 1167.87 1188.04 1190.94 1208.11 1252.09 1274.77 1282.67 1296.56 1323.68 1331.26 1335.14 1341.57 1368.45 1393.09 1399.30 1419.29 1432.65 1440.37 1461.32 1483.80 1489.49 1493.38 1507.16 1541.53 1577.08 1595.54 1632.71 1655.92 1725.78 1757.14 1868.02 1890.63 2768.05 3095.19 3106.18 3106.78 3114.47 3121.14 3125.75 3129.94 3156.73 3163.31 3169.45 3191.22 3213.52 3554.89 3602.91 3633.02 3790.17 3799.02
formula: C10H18N3O6S
InChI: InChI=1S/C10H18N3O6S/c11-5(10(18)19)1-2-7(14)13-6(4-20)9(17)12-3-8(15)16/h5-6,12-13,15,18,20H,1-4H2,11H3
38 atoms
N  -0.46706 3.043674 2.108867
H  -0.229593 3.281047 3.060582
C  -1.156441 4.055613 1.344109
H  -0.644842 5.012189 1.461199
C  -2.607319 4.22798 1.775616
O  -3.181366 3.506068 2.541624
C  -0.24157 1.754541 1.808923
C  -0.74407 1.213201 0.457724
O  0.345128 1.017324 2.601629
N  -0.00733 0.023012 0.098138
H  -0.579026 1.969114 -0.310236
C  -2.240563 0.884031 0.517415
H  -0.477044 -0.852764 0.279175
H  -2.804615 1.760791 0.823516
H  -2.565206 0.579288 -0.4762
O  -3.148313 5.290343 1.169321
H  -4.066645 5.374276 1.460975
H  -1.135569 3.831523 0.278713
S  -2.546129 -0.471606 1.694072
H  -3.661452 -0.917131 1.107816
C  1.333655 0.037366 0.043025
O  1.969521 1.09567 0.031876
C  2.023103 -1.306593 0.116901
H  1.395753 -2.081131 -0.326376
H  2.948709 -1.259374 -0.456434
C  2.298466 -1.690118 1.582113
H  2.633733 -2.726461 1.609925
H  1.377597 -1.627729 2.166639
C  3.382722 -0.883085 2.296673
H  3.487251 -1.269404 3.313736
N  3.036983 0.567977 2.420238
H  2.961327 0.986746 1.469732
H  2.086778 0.699007 2.81483
C  4.750898 -1.042165 1.635951
O  5.100254 -2.038459 1.07938
O  5.509312 0.055891 1.801232
H  6.37614 -0.103774 1.40145
H  3.73455 1.068485 2.965049
totalener: -1406.24807473 hartree
nucrepener: 1849.90644848 hartree
electener: -3256.15452321 hartree
oneelecener: -5583.85024534 hartree
twoeener: 2327.69572213 hartree
kineticenergy: 1400.66508707 hartree
exchangeener: -105.327812698815 hartree
correlationener: -7.054134757844 hartree
xcener: -112.381947456659 hartree
temp: 298.15 k
press: 1.00 atm
thermalcorrenthalpy: 0.00094421 hartree
totalenthalpy: -1405.99965842 hartree
totalentropycorr: -0.06577181 hartree
gibbsenthalpy: -1406.06543023 hartree
gibbsminuselec: 0.26362065 hartree
chargesum: 1.0000000
charge: -0.139644 0.190748 -0.117427 0.157320 0.270116 -0.283463 0.254817 0.057517 -0.450480 -0.163294 0.136941 -0.166318 0.164133 0.117359 0.151025 -0.254846 0.247623 0.126157 -0.145930 0.126074 0.206047 -0.411973 -0.182283 0.125274 0.131745 -0.171841 0.145704 0.130315 -0.010612 0.154847 -0.068757 0.228878 0.235238 0.267388 -0.248368 -0.288031 0.255110 0.222893
charge: 0.357134 0.000500 -0.042401 0.041917 -0.458951 0.131509 -0.361284 -0.134979 0.075138 0.349177 0.036458 -0.212136 -0.032122 0.005362 0.012236 0.376597 -0.076404 0.036027 0.500145 -0.141423 -0.365520 0.087194 0.003583 0.038170 0.040077 0.006347 0.047180 0.033592 -0.052129 0.050655 0.603060 -0.006717 -0.006822 -0.434745 0.167333 0.360517 -0.068603 0.034326
qa: -0.1396 0.1907 -0.1174 0.1573 0.2701 -0.2835 0.2548 0.0575 -0.4505 -0.1633 0.1369 -0.1663 0.1641 0.1174 0.1510 -0.2548 0.2476 0.1262 -0.1459 0.1261 0.2060 -0.4120 -0.1823 0.1253 0.1317 -0.1718 0.1457 0.1303 -0.0106 0.1548 -0.0688 0.2289 0.2352 0.2674 -0.2484 -0.2880 0.2551 0.2229
va: 3.2145 1.0170 3.8398 1.0031 4.3512 2.2017 4.2330 3.8272 2.0396 3.2362 1.0082 3.9918 1.0657 1.0296 0.9928 2.2317 1.0101 1.0101 2.1797 1.0166 4.2217 2.0761 3.8426 1.0086 1.0275 3.8739 1.0123 1.0219 3.8324 0.9974 3.5819 1.0596 1.0398 4.3800 2.2515 2.1978 1.0088 0.9855
dispcorr: -0.081919571 hartree
energy: -1406.335128491975
dipole: 1.97085 -0.64995 1.32090 -2.33743 2.91290 0.57547 -2.22410 2.43033 0.20623
magnitude: 1.45550 au
magnitude: 3.69958 debye
zeropoint: 0.31115356 hartree
thermalvibcorrection: 0.01842532 hartree
thermalrotcorrection: 0.00141627 hartree
thermaltrasncorrection: 0.00141627 hartree
thermaltotal: -1406.00271707 hartree
thermalcorr: 0.02125786 hartree
nonthermalcorr: 0.31115356 hartree
totalcorr: 0.33241143 hartree
totalenthalpy: -1406.00177286 hartree
