program: Orca
programVersion: 5.0.2
elementType: N H C H C O C C O N H C H H H O H H S H C O C H H C H H C H N H H C O O H H
charge: 1
multiplicity: 1
keywords: wB97X-D3BJ Opt Freq def2-TZVPP def2/J RIJCOSX VeryTightSCF
keywords: PAL8 defgrid3 TightOpt
frequency: 0.00 0.00 0.00 0.00 0.00 0.00 34.81 37.39 61.30 69.62 86.94 95.04 107.19 116.87 125.17 137.54 156.53 166.55 191.39 201.14 203.18 209.27 243.94 247.64 273.66 285.16 311.44 343.52 357.92 378.17 433.67 446.81 495.41 506.60 524.21 551.13 564.88 577.66 605.90 620.67 646.74 690.23 719.87 730.35 749.52 788.13 794.78 810.95 818.76 831.26 846.30 906.26 915.65 922.46 962.76 985.93 1000.70 1037.67 1054.86 1069.15 1088.44 1113.29 1143.43 1163.24 1172.89 1205.06 1212.20 1222.12 1256.09 1270.17 1279.45 1292.87 1302.66 1351.03 1361.26 1365.57 1384.96 1399.19 1408.53 1419.41 1426.75 1448.77 1476.14 1491.95 1495.78 1501.61 1502.99 1525.42 1544.30 1592.61 1642.23 1670.26 1756.47 1789.25 1811.24 1825.69 2753.45 3074.46 3079.17 3109.56 3114.87 3127.96 3143.83 3148.70 3150.99 3165.53 3215.35 3243.92 3384.97 3498.78 3560.54 3612.02 3643.81 3809.24
frequency: 34.81 37.39 61.30 69.62 86.94 95.04 107.19 116.87 125.17 137.54 156.53 166.55 191.39 201.14 203.18 209.27 243.94 247.64 273.66 285.16 311.44 343.52 357.92 378.17 433.67 446.81 495.41 506.60 524.21 551.13 564.88 577.66 605.90 620.67 646.74 690.23 719.87 730.35 749.52 788.13 794.78 810.95 818.76 831.26 846.30 906.26 915.65 922.46 962.76 985.93 1000.70 1037.67 1054.86 1069.15 1088.44 1113.29 1143.43 1163.24 1172.89 1205.06 1212.20 1222.12 1256.09 1270.17 1279.45 1292.87 1302.66 1351.03 1361.26 1365.57 1384.96 1399.19 1408.53 1419.41 1426.75 1448.77 1476.14 1491.95 1495.78 1501.61 1502.99 1525.42 1544.30 1592.61 1642.23 1670.26 1756.47 1789.25 1811.24 1825.69 2753.45 3074.46 3079.17 3109.56 3114.87 3127.96 3143.83 3148.70 3150.99 3165.53 3215.35 3243.92 3384.97 3498.78 3560.54 3612.02 3643.81 3809.24
formula: C10H18N3O6S
InChI: InChI=1S/C10H18N3O6S/c11-5(10(18)19)1-2-7(14)13-6(4-20)9(17)12-3-8(15)16/h5-6,12-13,15,18,20H,1-4H2,11H3
38 atoms
N  -2.600858 0.374615 1.753247
H  -2.949491 0.373421 2.702147
C  -3.014914 -0.738328 0.92223
H  -4.10229 -0.810045 0.921029
C  -2.428812 -2.038776 1.462801
O  -1.378384 -2.530714 1.090593
C  -1.481113 1.142917 1.615295
C  -0.758718 1.229626 0.265528
O  -1.049635 1.754693 2.581272
N  -0.021675 -0.005901 0.046825
H  -0.00588 1.999939 0.421681
C  -1.610044 1.662694 -0.930422
H  -0.492895 -0.894193 0.089414
H  -0.929182 1.854323 -1.760629
H  -2.309073 0.900533 -1.270192
O  -3.183465 -2.555461 2.417287
H  -2.777664 -3.358621 2.769741
H  -2.678223 -0.606601 -0.100279
S  -2.476058 3.220415 -0.640738
H  -3.393103 2.743637 0.209312
C  1.343215 -0.009658 -0.001142
O  2.019513 0.992217 -0.044788
C  1.987461 -1.386948 0.083702
H  1.259868 -2.189298 -0.071862
H  2.713784 -1.449126 -0.72657
C  2.745523 -1.52661 1.410299
H  3.306273 -0.608008 1.589811
H  3.48184 -2.331868 1.333933
C  1.900042 -1.791108 2.65578
H  2.569802 -1.924018 3.5086
N  1.11635 -3.075446 2.518621
H  0.27595 -2.93307 1.930008
H  1.693495 -3.819088 2.128824
C  0.850045 -0.748241 3.055743
O  -0.25949 -1.107927 3.379423
O  1.303844 0.475109 3.015593
H  0.553374 1.113727 3.101429
H  0.763029 -3.364638 3.429885
totalener: -1406.21821586 hartree
nucrepener: 1979.88147805 hartree
electener: -3386.09969391 hartree
oneelecener: -5842.93517703 hartree
twoeener: 2456.83548312 hartree
kineticenergy: 1400.64309150 hartree
exchangeener: -105.322153062606 hartree
correlationener: -7.058307099009 hartree
xcener: -112.380460161615 hartree
temp: 298.15 k
press: 1.00 atm
thermalcorrenthalpy: 0.00094421 hartree
totalenthalpy: -1405.97411014 hartree
totalentropycorr: -0.06470980 hartree
gibbsenthalpy: -1406.03881993 hartree
gibbsminuselec: 0.26482820 hartree
chargesum: 1.0000000
charge: -0.159254 0.199009 -0.090410 0.168241 0.378943 -0.431099 0.159919 0.064453 -0.345176 -0.235857 0.142875 -0.172650 0.182199 0.138921 0.102195 -0.210138 0.232628 0.108311 -0.106957 0.097314 0.229498 -0.318163 -0.204525 0.077865 0.146456 -0.182701 0.152213 0.122195 0.018003 0.176935 -0.086486 0.241736 0.229109 0.251665 -0.349044 -0.238544 0.271570 0.238749
charge: 0.330989 -0.001922 -0.037643 0.041551 -0.407507 0.091507 -0.370567 -0.143562 0.120940 0.330505 0.050348 -0.247385 -0.056983 0.021749 -0.008431 0.416175 -0.076131 0.027439 0.511437 -0.154027 -0.398401 0.118526 -0.006307 0.013462 0.046647 -0.002131 0.054932 0.031092 -0.042155 0.049981 0.610911 0.011997 0.050267 -0.465003 0.106077 0.423311 -0.095507 0.053818
qa: -0.1593 0.1990 -0.0904 0.1682 0.3789 -0.4311 0.1599 0.0645 -0.3452 -0.2359 0.1429 -0.1726 0.1822 0.1389 0.1022 -0.2101 0.2326 0.1083 -0.1070 0.0973 0.2295 -0.3182 -0.2045 0.0779 0.1465 -0.1827 0.1522 0.1222 0.0180 0.1769 -0.0865 0.2417 0.2291 0.2517 -0.3490 -0.2385 0.2716 0.2387
va: 3.0775 1.0141 3.8548 0.9987 4.1675 2.0546 4.2753 3.6301 2.1385 3.1132 1.0610 4.0384 1.0350 1.0028 1.0050 2.3075 1.0241 1.0313 2.1725 1.0307 4.2469 2.2106 3.8995 1.0247 1.0163 3.8879 1.0240 1.0001 3.7259 0.9856 3.6816 1.0475 0.9758 4.4245 2.1295 2.3036 1.0429 0.9772
dispcorr: -0.085858733 hartree
energy: -1406.309869059997
dipole: 5.43897 -4.83707 0.60190 -11.86035 6.23050 -5.62985 -2.04949 3.37845 1.32896
magnitude: 5.81581 au
magnitude: 14.78261 debye
zeropoint: 0.31165597 hartree
thermalvibcorrection: 0.01817471 hartree
thermalrotcorrection: 0.00141627 hartree
thermaltrasncorrection: 0.00141627 hartree
thermaltotal: -1405.97720585 hartree
thermalcorr: 0.02100725 hartree
nonthermalcorr: 0.31165597 hartree
totalcorr: 0.33266321 hartree
totalenthalpy: -1405.97626164 hartree
