program: Orca
programVersion: 5.0.2
elementType: N H C H C O C C O N H C H H H O H H S H C O C H H C H H C H N H H C O O H H
charge: 1
multiplicity: 1
keywords: wB97X-D3BJ Opt Freq def2-TZVPP def2/J RIJCOSX VeryTightSCF
keywords: PAL8 defgrid3 TightOpt
frequency: 0.00 0.00 0.00 0.00 0.00 0.00 17.72 31.92 41.45 51.79 56.38 63.38 78.55 85.89 116.63 129.64 150.12 161.21 173.56 186.98 198.33 214.28 229.37 278.24 282.50 305.92 315.15 333.54 357.55 383.53 431.97 435.60 448.92 505.80 522.74 546.40 582.43 592.72 625.98 636.57 649.57 650.81 680.67 698.85 732.22 751.84 760.01 800.16 823.47 855.39 891.73 899.75 907.74 933.37 946.72 966.07 1008.48 1021.02 1060.90 1100.61 1120.34 1133.93 1146.10 1177.62 1182.69 1202.17 1213.21 1224.68 1255.03 1290.98 1297.66 1310.92 1313.51 1347.55 1367.11 1381.30 1384.30 1411.76 1419.88 1424.96 1435.15 1437.19 1451.67 1490.89 1492.34 1496.43 1506.03 1538.58 1547.56 1613.56 1629.68 1681.77 1728.89 1797.37 1807.58 1861.75 2764.13 3024.48 3068.39 3083.57 3096.62 3107.44 3117.77 3121.31 3139.28 3157.69 3197.07 3206.19 3295.41 3541.19 3636.77 3659.33 3787.37 3793.44
frequency: 17.72 31.92 41.45 51.79 56.38 63.38 78.55 85.89 116.63 129.64 150.12 161.21 173.56 186.98 198.33 214.28 229.37 278.24 282.50 305.92 315.15 333.54 357.55 383.53 431.97 435.60 448.92 505.80 522.74 546.40 582.43 592.72 625.98 636.57 649.57 650.81 680.67 698.85 732.22 751.84 760.01 800.16 823.47 855.39 891.73 899.75 907.74 933.37 946.72 966.07 1008.48 1021.02 1060.90 1100.61 1120.34 1133.93 1146.10 1177.62 1182.69 1202.17 1213.21 1224.68 1255.03 1290.98 1297.66 1310.92 1313.51 1347.55 1367.11 1381.30 1384.30 1411.76 1419.88 1424.96 1435.15 1437.19 1451.67 1490.89 1492.34 1496.43 1506.03 1538.58 1547.56 1613.56 1629.68 1681.77 1728.89 1797.37 1807.58 1861.75 2764.13 3024.48 3068.39 3083.57 3096.62 3107.44 3117.77 3121.31 3139.28 3157.69 3197.07 3206.19 3295.41 3541.19 3636.77 3659.33 3787.37 3793.44
formula: C10H18N3O6S
InChI: InChI=1S/C10H18N3O6S/c11-5(10(18)19)1-2-7(14)13-6(4-20)9(17)12-3-8(15)16/h5-6,12-13,15,18,20H,1-4H2,11H3
38 atoms
N  -1.054911 1.919896 -2.322635
H  -1.673181 2.04502 -3.11008
C  0.352537 2.090862 -2.55229
H  0.547591 3.072839 -2.997775
C  0.955537 1.071385 -3.503819
O  2.106699 0.684038 -3.447581
C  -1.687849 1.374325 -1.241058
C  -0.924871 1.130574 0.079602
O  -2.865805 1.098978 -1.283773
N  0.025785 0.011568 -0.037941
H  -1.717553 0.754792 0.728005
C  -0.376576 2.39352 0.743269
H  -0.414667 -0.893854 -0.044176
H  0.111146 2.117417 1.677107
H  0.34152 2.918907 0.124102
O  0.110093 0.666221 -4.439503
H  0.566669 0.064796 -5.044521
H  0.916544 2.045322 -1.626424
S  -1.803789 3.470356 1.070411
H  -1.086237 4.495082 1.542338
C  1.363769 0.019357 -0.014692
O  2.033853 1.060046 0.003926
C  2.036566 -1.344457 -0.000375
H  2.587564 -1.406187 0.942481
H  1.287198 -2.136573 0.022041
C  2.983489 -1.624624 -1.178637
H  2.47746 -1.454283 -2.131519
H  3.240188 -2.683029 -1.143232
C  4.312138 -0.864008 -1.170513
H  4.768761 -0.925021 -0.17895
N  4.128718 0.577345 -1.490059
H  5.025664 1.049395 -1.584243
H  3.60449 0.68611 -2.372722
C  5.323802 -1.406508 -2.176163
O  5.877587 -0.703962 -2.976738
O  5.521092 -2.712842 -2.023833
H  6.193144 -3.003215 -2.657376
H  3.506903 0.990996 -0.756314
totalener: -1406.23564789 hartree
nucrepener: 1858.05344681 hartree
electener: -3264.28909470 hartree
oneelecener: -5599.50243809 hartree
twoeener: 2335.21334339 hartree
kineticenergy: 1400.65214048 hartree
exchangeener: -105.326280933033 hartree
correlationener: -7.053372346131 hartree
xcener: -112.379653279164 hartree
temp: 298.15 k
press: 1.00 atm
thermalcorrenthalpy: 0.00094421 hartree
totalenthalpy: -1405.98573781 hartree
totalentropycorr: -0.06593157 hartree
gibbsenthalpy: -1406.05166939 hartree
gibbsminuselec: 0.26391730 hartree
chargesum: 1.0000000
charge: -0.184085 0.194600 -0.072932 0.151984 0.354539 -0.402777 0.168357 -0.004917 -0.285888 -0.169694 0.157829 -0.169704 0.192951 0.130972 0.116867 -0.235707 0.244900 0.094477 -0.112326 0.109905 0.290768 -0.458542 -0.168904 0.123680 0.106364 -0.214539 0.114966 0.154044 0.021335 0.142057 -0.075367 0.224115 0.239305 0.280479 -0.285215 -0.251506 0.255307 0.222303
charge: 0.325909 -0.006056 -0.051717 0.044003 -0.411584 0.099982 -0.399774 -0.130264 0.120672 0.358461 0.047543 -0.234693 -0.003325 0.007757 -0.007327 0.403494 -0.070573 0.019565 0.505092 -0.145592 -0.361051 0.110790 0.000678 0.043455 0.034018 0.002174 0.030628 0.043704 -0.056073 0.047904 0.605673 0.038720 0.001801 -0.437282 0.137450 0.393079 -0.065275 -0.041965
qa: -0.1841 0.1946 -0.0729 0.1520 0.3545 -0.4028 0.1684 -0.0049 -0.2859 -0.1697 0.1578 -0.1697 0.1930 0.1310 0.1169 -0.2357 0.2449 0.0945 -0.1123 0.1099 0.2908 -0.4585 -0.1689 0.1237 0.1064 -0.2145 0.1150 0.1540 0.0213 0.1421 -0.0754 0.2241 0.2393 0.2805 -0.2852 -0.2515 0.2553 0.2223
va: 3.0852 1.0160 3.8520 0.9898 4.1909 2.0479 4.3597 3.6814 2.2323 3.2379 1.0171 4.0666 1.0046 1.0029 1.0018 2.2823 1.0159 1.0533 2.1750 1.0206 4.0830 2.0324 3.8543 1.0110 1.0172 3.8574 1.0222 1.0166 3.8161 1.0069 3.6131 0.9879 1.0402 4.3945 2.2099 2.2478 1.0044 1.0696
dispcorr: -0.080511254 hartree
energy: -1406.320946647832
dipole: 7.05540 -3.55705 3.49835 -3.26733 1.58189 -1.68544 4.13838 -4.44100 -0.30262
magnitude: 3.89496 au
magnitude: 9.90021 debye
zeropoint: 0.31126997 hartree
thermalvibcorrection: 0.01865162 hartree
thermalrotcorrection: 0.00141627 hartree
thermaltrasncorrection: 0.00141627 hartree
thermaltotal: -1405.98819251 hartree
thermalcorr: 0.02148417 hartree
nonthermalcorr: 0.31126997 hartree
totalcorr: 0.33275414 hartree
totalenthalpy: -1405.98724830 hartree
