program: Orca
programVersion: 5.0.2
elementType: N H C H C O C C O N H C H H H O H H S H C O C H H C H H C H N H H C O O H H
charge: 1
multiplicity: 1
keywords: wB97X-D3BJ Opt Freq def2-TZVPP def2/J RIJCOSX VeryTightSCF
keywords: PAL8 defgrid3 TightOpt
frequency: 0.00 0.00 0.00 0.00 0.00 0.00 15.40 21.39 31.33 36.37 48.41 53.42 82.29 91.37 103.90 119.17 136.00 176.64 187.52 201.72 215.98 235.03 249.49 275.76 277.81 314.14 316.96 339.08 353.09 381.48 413.32 417.59 466.95 511.67 529.23 574.63 586.05 597.52 607.52 626.50 654.64 661.99 667.39 692.57 723.61 742.37 744.82 799.63 822.50 841.43 858.76 881.51 886.93 931.77 956.43 966.45 1021.89 1027.68 1054.79 1089.62 1110.04 1137.31 1162.53 1182.33 1185.34 1189.43 1210.80 1251.73 1254.27 1285.31 1295.17 1308.63 1311.76 1334.27 1336.29 1362.18 1375.94 1406.95 1420.07 1427.50 1436.37 1449.10 1460.82 1473.24 1478.38 1491.15 1493.50 1531.69 1538.29 1636.83 1644.00 1666.84 1712.92 1798.02 1849.63 1853.13 2761.16 2781.85 3081.59 3092.09 3115.20 3120.79 3127.98 3131.11 3134.30 3152.76 3163.68 3202.24 3393.43 3539.53 3639.38 3652.17 3783.00 3804.37
frequency: 15.40 21.39 31.33 36.37 48.41 53.42 82.29 91.37 103.90 119.17 136.00 176.64 187.52 201.72 215.98 235.03 249.49 275.76 277.81 314.14 316.96 339.08 353.09 381.48 413.32 417.59 466.95 511.67 529.23 574.63 586.05 597.52 607.52 626.50 654.64 661.99 667.39 692.57 723.61 742.37 744.82 799.63 822.50 841.43 858.76 881.51 886.93 931.77 956.43 966.45 1021.89 1027.68 1054.79 1089.62 1110.04 1137.31 1162.53 1182.33 1185.34 1189.43 1210.80 1251.73 1254.27 1285.31 1295.17 1308.63 1311.76 1334.27 1336.29 1362.18 1375.94 1406.95 1420.07 1427.50 1436.37 1449.10 1460.82 1473.24 1478.38 1491.15 1493.50 1531.69 1538.29 1636.83 1644.00 1666.84 1712.92 1798.02 1849.63 1853.13 2761.16 2781.85 3081.59 3092.09 3115.20 3120.79 3127.98 3131.11 3134.30 3152.76 3163.68 3202.24 3393.43 3539.53 3639.38 3652.17 3783.00 3804.37
formula: C10H18N3O6S
InChI: InChI=1S/C10H18N3O6S/c11-5(10(18)19)1-2-7(14)13-6(4-20)9(17)12-3-8(15)16/h5-6,12-13,15,18,20H,1-4H2,11H3
38 atoms
N  -1.048994 1.74205 -2.311391
H  -1.676252 1.943832 -3.074942
C  0.358908 1.895202 -2.563005
H  0.517034 2.730444 -3.24529
C  1.028324 0.6587 -3.148872
O  0.696815 -0.480889 -2.950669
C  -1.716204 1.460516 -1.160435
C  -0.961548 1.068298 0.127079
O  -2.926538 1.513634 -1.102787
N  0.007291 -0.010729 -0.044483
H  -1.760647 0.639807 0.732814
C  -0.451918 2.298499 0.879377
H  -0.402155 -0.917584 -0.202515
H  -1.302356 2.960317 1.0360
H  0.301003 2.84868 0.32425
O  2.089829 1.003869 -3.890553
H  2.48992 0.195889 -4.239013
H  0.90483 2.13377 -1.649957
S  0.296823 1.918338 2.483506
H  -0.830447 1.766162 3.186441
C  1.333801 0.028367 0.011582
O  1.986013 1.086513 0.060401
C  2.027389 -1.323012 0.011481
H  1.483087 -2.009195 0.665217
H  1.941579 -1.721432 -1.003363
C  3.502609 -1.272401 0.407904
H  4.059663 -0.614849 -0.264223
H  3.917258 -2.273692 0.290024
C  3.765808 -0.842046 1.859269
H  3.061748 -1.329175 2.535128
N  3.641485 0.641286 2.019845
H  4.59208 1.028519 2.054541
H  3.081045 1.016844 1.202186
C  5.190051 -1.189504 2.285877
O  6.026701 -0.345945 2.474298
O  5.367166 -2.498114 2.394401
H  6.28477 -2.676797 2.647671
H  3.156603 0.90132 2.876569
totalener: -1406.23430984 hartree
nucrepener: 1866.05077592 hartree
electener: -3272.28508576 hartree
oneelecener: -5615.69334769 hartree
twoeener: 2343.40826193 hartree
kineticenergy: 1400.66288637 hartree
exchangeener: -105.325485598933 hartree
correlationener: -7.054415359694 hartree
xcener: -112.379900958626 hartree
temp: 298.15 k
press: 1.00 atm
thermalcorrenthalpy: 0.00094421 hartree
totalenthalpy: -1405.98597627 hartree
totalentropycorr: -0.06598156 hartree
gibbsenthalpy: -1406.05195784 hartree
gibbsminuselec: 0.26349992 hartree
chargesum: 1.0000000
charge: -0.173184 0.190521 -0.105414 0.164773 0.291899 -0.331258 0.162335 -0.011783 -0.303823 -0.111076 0.142420 -0.118802 0.196978 0.162473 0.132839 -0.250661 0.235261 0.113631 -0.215292 0.124529 0.265887 -0.472427 -0.200414 0.123493 0.159452 -0.225856 0.133533 0.139621 0.018201 0.141337 -0.073071 0.223558 0.231125 0.292418 -0.292941 -0.242951 0.258565 0.224103
charge: 0.331705 -0.004242 -0.054159 0.038779 -0.438776 0.106267 -0.386198 -0.125721 0.109041 0.368863 0.046668 -0.229514 0.006996 0.024329 0.002477 0.373729 -0.084358 0.026170 0.467876 -0.141520 -0.370864 0.113581 -0.004241 0.035695 0.047480 0.003673 0.037118 0.043379 -0.044926 0.044182 0.604800 0.029285 -0.059821 -0.435153 0.142562 0.402686 -0.061624 0.033776
qa: -0.1732 0.1905 -0.1054 0.1648 0.2919 -0.3313 0.1623 -0.0118 -0.3038 -0.1111 0.1424 -0.1188 0.1970 0.1625 0.1328 -0.2507 0.2353 0.1136 -0.2153 0.1245 0.2659 -0.4724 -0.2004 0.1235 0.1595 -0.2259 0.1335 0.1396 0.0182 0.1413 -0.0731 0.2236 0.2311 0.2924 -0.2929 -0.2430 0.2586 0.2241
va: 3.1039 1.0148 3.7836 1.0055 4.3095 2.1569 4.4086 3.7644 2.2225 3.2389 1.0259 3.8369 1.0021 1.0083 1.0153 2.2373 1.0216 1.0269 2.1385 1.0202 4.1218 1.9735 3.7971 1.0124 1.0091 3.8751 1.0103 1.0214 3.8334 1.0133 3.5901 1.0152 1.0806 4.3512 2.1974 2.2717 1.0014 0.9926
dispcorr: -0.081526518 hartree
energy: -1406.321282078543
dipole: 3.03950 -0.28519 2.75431 -1.48874 0.20561 -1.28313 2.68362 -1.13478 1.54885
magnitude: 3.41051 au
magnitude: 8.66883 debye
zeropoint: 0.31065061 hartree
thermalvibcorrection: 0.01869340 hartree
thermalrotcorrection: 0.00141627 hartree
thermaltrasncorrection: 0.00141627 hartree
thermaltotal: -1405.98910553 hartree
thermalcorr: 0.02152594 hartree
nonthermalcorr: 0.31065061 hartree
totalcorr: 0.33217655 hartree
totalenthalpy: -1405.98816132 hartree
