program: Orca
programVersion: 5.0.2
elementType: N H C H C O C C O N H C H H H O H H S H C O C H H C H H C H N H H C O O H H
charge: 1
multiplicity: 1
keywords: wB97X-D3BJ Opt Freq def2-TZVPP def2/J RIJCOSX VeryTightSCF
keywords: PAL8 defgrid3 TightOpt
frequency: 0.00 0.00 0.00 0.00 0.00 0.00 22.17 48.27 59.15 60.90 74.45 77.56 103.16 107.76 110.05 128.64 134.46 164.94 168.94 187.17 206.54 223.04 252.20 257.36 283.93 299.49 319.80 344.93 349.55 381.71 441.51 466.38 475.02 506.51 529.35 555.25 587.13 592.09 602.31 638.93 649.04 669.03 700.35 713.50 723.10 744.75 788.85 801.36 816.11 831.02 877.95 907.11 914.35 926.82 967.34 1003.07 1012.10 1035.33 1058.24 1073.93 1113.50 1119.96 1129.01 1154.54 1180.73 1214.22 1225.54 1238.43 1244.92 1258.99 1273.46 1275.57 1300.78 1316.92 1337.18 1362.47 1389.00 1395.07 1398.83 1411.24 1426.57 1450.52 1453.65 1483.97 1484.48 1492.35 1502.46 1503.74 1522.49 1574.06 1665.79 1686.86 1747.51 1823.25 1834.70 1844.63 2753.42 3066.68 3091.01 3094.80 3101.87 3120.17 3148.07 3152.65 3155.24 3168.88 3176.38 3189.42 3359.59 3543.92 3588.95 3600.50 3783.91 3784.88
frequency: 22.17 48.27 59.15 60.90 74.45 77.56 103.16 107.76 110.05 128.64 134.46 164.94 168.94 187.17 206.54 223.04 252.20 257.36 283.93 299.49 319.80 344.93 349.55 381.71 441.51 466.38 475.02 506.51 529.35 555.25 587.13 592.09 602.31 638.93 649.04 669.03 700.35 713.50 723.10 744.75 788.85 801.36 816.11 831.02 877.95 907.11 914.35 926.82 967.34 1003.07 1012.10 1035.33 1058.24 1073.93 1113.50 1119.96 1129.01 1154.54 1180.73 1214.22 1225.54 1238.43 1244.92 1258.99 1273.46 1275.57 1300.78 1316.92 1337.18 1362.47 1389.00 1395.07 1398.83 1411.24 1426.57 1450.52 1453.65 1483.97 1484.48 1492.35 1502.46 1503.74 1522.49 1574.06 1665.79 1686.86 1747.51 1823.25 1834.70 1844.63 2753.42 3066.68 3091.01 3094.80 3101.87 3120.17 3148.07 3152.65 3155.24 3168.88 3176.38 3189.42 3359.59 3543.92 3588.95 3600.50 3783.91 3784.88
formula: C10H18N3O6S
InChI: InChI=1S/C10H18N3O6S/c11-5(10(18)19)1-2-7(14)13-6(4-20)9(17)12-3-8(15)16/h5-6,12-13,15,18,20H,1-4H2,11H3
38 atoms
N  0.045501 3.561156 0.44834
H  -0.019019 4.185854 1.242304
C  1.286459 3.780181 -0.297132
H  1.449423 4.861203 -0.334376
C  1.228741 3.3147 -1.740715
O  2.101233 2.669344 -2.275824
C  -0.390815 2.294808 0.857986
C  -0.632421 1.248136 -0.236735
O  -0.734262 2.095455 1.997318
N  0.075589 0.004896 -0.007967
H  -0.305934 1.644242 -1.196482
C  -2.14483 0.987779 -0.361086
H  -0.477376 -0.826683 0.144885
H  -2.677232 1.937325 -0.315107
H  -2.347971 0.548517 -1.338776
O  0.151079 3.680884 -2.430167
H  -0.464623 4.150079 -1.85011
H  2.146588 3.313112 0.172486
S  -2.833738 -0.182827 0.829303
H  -2.469714 0.486279 1.930285
C  1.409815 0.012558 0.12091
O  2.029355 1.068274 0.218526
C  2.131046 -1.316171 0.002164
H  1.780289 -1.998492 0.779959
H  1.815405 -1.775723 -0.940519
C  3.660767 -1.223252 0.083364
H  4.070349 -2.166482 -0.28517
H  3.972369 -1.141833 1.123988
C  4.343051 -0.048186 -0.646894
H  4.330292 0.828867 -0.005548
N  3.693258 0.368936 -1.932809
H  3.093387 -0.35921 -2.314405
H  3.121707 1.230989 -1.828946
C  5.793416 -0.353106 -1.004398
O  6.234798 -0.185801 -2.112882
O  6.47882 -0.789747 0.041426
H  7.397333 -0.946046 -0.222778
H  4.448764 0.529045 -2.613996
totalener: -1406.22257178 hartree
nucrepener: 1870.14838029 hartree
electener: -3276.37095207 hartree
oneelecener: -5624.05076312 hartree
twoeener: 2347.67981105 hartree
kineticenergy: 1400.64976778 hartree
exchangeener: -105.317069757199 hartree
correlationener: -7.056082714348 hartree
xcener: -112.373152471547 hartree
temp: 298.15 k
press: 1.00 atm
thermalcorrenthalpy: 0.00094421 hartree
totalenthalpy: -1405.97400758 hartree
totalentropycorr: -0.06536319 hartree
gibbsenthalpy: -1406.03937077 hartree
gibbsminuselec: 0.26442944 hartree
chargesum: 1.0000000
charge: -0.255796 0.182389 -0.133913 0.167605 0.357972 -0.360559 0.252324 -0.023172 -0.305039 -0.167964 0.104427 -0.162795 0.171195 0.121174 0.143240 -0.217388 0.237418 0.132908 -0.150789 0.140584 0.315999 -0.479404 -0.233327 0.149150 0.126570 -0.191694 0.128577 0.130735 0.020511 0.153993 -0.061857 0.211207 0.253039 0.302315 -0.304206 -0.238554 0.254024 0.229103
charge: 0.274114 -0.013410 -0.058863 0.041237 -0.431812 0.123020 -0.365498 -0.136420 0.136239 0.344992 0.027282 -0.230976 -0.034614 0.013953 0.014753 0.404620 -0.086717 0.019191 0.500722 -0.139696 -0.377435 0.090169 -0.009113 0.047083 0.030908 0.005732 0.036465 0.045766 -0.050825 0.042190 0.615019 0.043997 -0.003463 -0.433348 0.136541 0.406602 -0.062483 0.034078
qa: -0.2558 0.1824 -0.1339 0.1676 0.3580 -0.3606 0.2523 -0.0232 -0.3050 -0.1680 0.1044 -0.1628 0.1712 0.1212 0.1432 -0.2174 0.2374 0.1329 -0.1508 0.1406 0.3160 -0.4794 -0.2333 0.1492 0.1266 -0.1917 0.1286 0.1307 0.0205 0.1540 -0.0619 0.2112 0.2530 0.3023 -0.3042 -0.2386 0.2540 0.2291
va: 3.0037 1.0178 3.8989 0.9814 4.1889 2.1329 4.1621 3.9358 2.1944 3.1940 1.0547 3.9865 1.0654 1.0076 0.9916 2.2591 1.0178 1.0144 2.1801 1.0281 4.0966 1.9900 3.8612 1.0057 1.0050 3.8946 1.0072 1.0117 3.8244 1.0195 3.6000 0.9915 1.0484 4.3370 2.1876 2.2721 1.0047 1.0144
dispcorr: -0.081807851 hartree
energy: -1406.310313203464
dipole: 2.54203 -0.37795 2.16407 -3.01948 2.33816 -0.68132 -1.19899 0.32002 -0.87898
magnitude: 2.43311 au
magnitude: 6.18446 debye
zeropoint: 0.31140676 hartree
thermalvibcorrection: 0.01833757 hartree
thermalrotcorrection: 0.00141627 hartree
thermaltrasncorrection: 0.00141627 hartree
thermaltotal: -1405.97773633 hartree
thermalcorr: 0.02117012 hartree
nonthermalcorr: 0.31140676 hartree
totalcorr: 0.33257687 hartree
totalenthalpy: -1405.97679212 hartree
