program: Orca
programVersion: 5.0.2
elementType: N H C H C O C C O N H C H H H O H H S H C O C H H C H H C H N H H C O O H H
charge: 1
multiplicity: 1
keywords: wB97X-D3BJ Opt Freq def2-TZVPP def2/J RIJCOSX VeryTightSCF
keywords: PAL8 defgrid3 TightOpt
frequency: 0.00 0.00 0.00 0.00 0.00 0.00 14.48 29.49 33.11 58.90 62.20 72.42 81.54 102.71 134.30 137.67 168.91 177.50 188.90 204.88 234.11 253.79 258.46 285.65 290.36 309.72 324.87 361.29 379.25 394.16 436.54 452.20 489.52 511.18 516.59 539.49 549.50 553.77 584.10 617.95 640.46 657.50 676.46 692.83 716.34 741.73 756.81 800.67 814.26 834.97 887.47 890.14 922.28 924.44 940.10 989.24 1009.02 1018.75 1046.57 1091.62 1118.51 1124.29 1149.56 1168.61 1171.11 1187.98 1192.69 1212.75 1230.83 1286.88 1292.00 1304.41 1308.33 1335.32 1352.99 1364.61 1391.59 1394.06 1414.70 1414.91 1415.79 1437.48 1464.03 1480.38 1488.46 1504.87 1527.17 1533.05 1574.92 1588.59 1625.45 1671.82 1699.24 1742.15 1873.95 1884.33 2763.51 2880.92 3083.90 3096.65 3099.47 3109.66 3119.16 3122.39 3149.51 3159.04 3180.66 3205.31 3422.83 3560.04 3629.81 3685.84 3793.41 3800.30
frequency: 14.48 29.49 33.11 58.90 62.20 72.42 81.54 102.71 134.30 137.67 168.91 177.50 188.90 204.88 234.11 253.79 258.46 285.65 290.36 309.72 324.87 361.29 379.25 394.16 436.54 452.20 489.52 511.18 516.59 539.49 549.50 553.77 584.10 617.95 640.46 657.50 676.46 692.83 716.34 741.73 756.81 800.67 814.26 834.97 887.47 890.14 922.28 924.44 940.10 989.24 1009.02 1018.75 1046.57 1091.62 1118.51 1124.29 1149.56 1168.61 1171.11 1187.98 1192.69 1212.75 1230.83 1286.88 1292.00 1304.41 1308.33 1335.32 1352.99 1364.61 1391.59 1394.06 1414.70 1414.91 1415.79 1437.48 1464.03 1480.38 1488.46 1504.87 1527.17 1533.05 1574.92 1588.59 1625.45 1671.82 1699.24 1742.15 1873.95 1884.33 2763.51 2880.92 3083.90 3096.65 3099.47 3109.66 3119.16 3122.39 3149.51 3159.04 3180.66 3205.31 3422.83 3560.04 3629.81 3685.84 3793.41 3800.30
formula: C10H18N3O6S
InChI: InChI=1S/C10H18N3O6S/c11-5(10(18)19)1-2-7(14)13-6(4-20)9(17)12-3-8(15)16/h5-6,12-13,15,18,20H,1-4H2,11H3
38 atoms
N  0.022178 3.436488 -0.970235
H  0.3215 3.79533 -1.864637
C  0.323874 4.277239 0.175069
H  0.353052 5.307961 -0.181886
C  1.672236 3.972534 0.807783
O  1.849622 3.853893 1.986168
C  -0.279496 2.133481 -1.046869
C  -0.899965 1.296213 0.095139
O  -0.135682 1.54795 -2.131723
N  -0.215744 0.010234 0.086201
H  -1.910065 1.098393 -0.277784
C  -1.032031 1.837455 1.521519
H  -0.752205 -0.816232 -0.111389
H  -1.223799 0.978717 2.16208
H  -0.12065 2.317471 1.870452
O  2.661508 3.89849 -0.107036
H  3.479181 3.741497 0.384424
H  -0.45241 4.222109 0.929519
S  -2.465353 2.949207 1.602086
H  -2.336619 3.270148 2.893897
C  1.124679 -0.051561 0.017657
O  1.816331 0.962362 0.118312
C  1.733203 -1.406287 -0.26588
H  2.082222 -1.820303 0.68317
H  0.990253 -2.094288 -0.667992
C  2.932238 -1.296973 -1.209885
H  3.315013 -2.300904 -1.394545
H  3.733528 -0.736041 -0.72468
C  2.686571 -0.676488 -2.586404
H  3.60349 -0.79601 -3.168502
N  2.415706 0.806748 -2.537957
H  1.388249 1.043213 -2.490056
H  2.80664 1.203856 -1.677824
C  1.585751 -1.365108 -3.39082
O  1.176439 -2.463412 -3.15813
O  1.185855 -0.586745 -4.405884
H  0.499851 -1.049372 -4.907636
H  2.79454 1.274404 -3.357514
totalener: -1406.22624077 hartree
nucrepener: 1958.11615449 hartree
electener: -3364.34239526 hartree
oneelecener: -5800.20473276 hartree
twoeener: 2435.86233750 hartree
kineticenergy: 1400.65910489 hartree
exchangeener: -105.324395240643 hartree
correlationener: -7.058415283192 hartree
xcener: -112.382810523835 hartree
temp: 298.15 k
press: 1.00 atm
thermalcorrenthalpy: 0.00094421 hartree
totalenthalpy: -1405.98162066 hartree
totalentropycorr: -0.06459953 hartree
gibbsenthalpy: -1406.04622019 hartree
gibbsminuselec: 0.26496110 hartree
chargesum: 1.0000000
charge: -0.134852 0.186000 -0.075443 0.145287 0.300975 -0.276187 0.218620 0.053687 -0.424892 -0.150022 0.129826 -0.172629 0.189552 0.129812 0.129462 -0.299781 0.238259 0.131085 -0.147454 0.130440 0.222626 -0.450142 -0.169824 0.136312 0.121050 -0.186595 0.137959 0.125639 -0.002316 0.149911 -0.069066 0.233458 0.219357 0.276291 -0.255235 -0.272849 0.253356 0.228326
charge: 0.352259 -0.003709 -0.038254 0.042508 -0.447927 0.140957 -0.345357 -0.124211 0.086533 0.356541 0.047906 -0.224905 -0.011992 0.009211 0.003929 0.344161 -0.086068 0.007072 0.504670 -0.138225 -0.377106 0.073557 0.002260 0.047025 0.030500 0.004486 0.048113 0.034778 -0.049052 0.049357 0.600416 -0.035038 0.025921 -0.437584 0.162315 0.372804 -0.068220 0.040368
qa: -0.1349 0.1860 -0.0754 0.1453 0.3010 -0.2762 0.2186 0.0537 -0.4249 -0.1500 0.1298 -0.1726 0.1896 0.1298 0.1295 -0.2998 0.2383 0.1311 -0.1475 0.1304 0.2226 -0.4501 -0.1698 0.1363 0.1210 -0.1866 0.1380 0.1256 -0.0023 0.1499 -0.0691 0.2335 0.2194 0.2763 -0.2552 -0.2728 0.2534 0.2283
va: 3.2114 1.0198 3.7475 0.9937 4.2531 2.2151 4.2505 3.7660 2.0763 3.2219 1.0154 4.0059 1.0088 1.0100 1.0252 2.1650 1.0192 1.0743 2.1779 1.0164 4.2281 2.0527 3.8250 1.0055 1.0272 3.9114 1.0101 1.0136 3.7893 0.9982 3.6124 1.0789 1.0173 4.3725 2.2386 2.2249 1.0089 0.9768
dispcorr: -0.083923878 hartree
energy: -1406.317479088293
dipole: 5.20327 -3.62688 1.57639 -4.09259 3.40596 -0.68662 -0.20940 -1.66839 -1.87779
magnitude: 2.54609 au
magnitude: 6.47163 debye
zeropoint: 0.31131470 hartree
thermalvibcorrection: 0.01825054 hartree
thermalrotcorrection: 0.00141627 hartree
thermaltrasncorrection: 0.00141627 hartree
thermaltotal: -1405.98508131 hartree
thermalcorr: 0.02108308 hartree
nonthermalcorr: 0.31131470 hartree
totalcorr: 0.33239777 hartree
totalenthalpy: -1405.98413710 hartree
