program: Orca
programVersion: 5.0.2
elementType: N H C H C O C C O N H C H H H O H H S H C O C H H C H H C H N H H C O O H H
charge: 1
multiplicity: 1
keywords: wB97X-D3BJ Opt Freq def2-TZVPP def2/J RIJCOSX VeryTightSCF
keywords: PAL8 defgrid3 TightOpt
frequency: 0.00 0.00 0.00 0.00 0.00 0.00 25.70 36.41 50.50 54.13 65.14 75.19 80.36 88.53 97.09 118.08 146.39 155.03 189.37 220.89 231.34 248.93 266.86 278.99 281.26 313.33 342.27 345.22 366.97 399.29 432.09 466.49 497.29 502.82 537.15 559.75 573.34 579.25 594.30 627.82 652.28 665.87 710.92 736.51 747.67 760.23 768.99 778.63 809.41 837.71 866.80 893.98 901.17 932.66 982.08 996.19 1023.53 1035.64 1063.07 1094.33 1122.41 1138.92 1157.37 1158.52 1188.43 1200.33 1214.26 1216.85 1237.76 1261.33 1278.68 1304.03 1310.10 1328.28 1343.55 1372.74 1387.56 1395.72 1408.77 1409.56 1423.57 1430.77 1461.16 1468.35 1479.90 1491.65 1493.47 1497.50 1571.45 1583.59 1622.19 1673.34 1732.10 1830.99 1844.29 1862.12 2751.69 2898.21 3094.14 3099.78 3101.74 3112.82 3119.81 3145.08 3147.72 3156.44 3157.20 3181.24 3388.53 3528.05 3611.96 3660.45 3724.71 3785.12
frequency: 25.70 36.41 50.50 54.13 65.14 75.19 80.36 88.53 97.09 118.08 146.39 155.03 189.37 220.89 231.34 248.93 266.86 278.99 281.26 313.33 342.27 345.22 366.97 399.29 432.09 466.49 497.29 502.82 537.15 559.75 573.34 579.25 594.30 627.82 652.28 665.87 710.92 736.51 747.67 760.23 768.99 778.63 809.41 837.71 866.80 893.98 901.17 932.66 982.08 996.19 1023.53 1035.64 1063.07 1094.33 1122.41 1138.92 1157.37 1158.52 1188.43 1200.33 1214.26 1216.85 1237.76 1261.33 1278.68 1304.03 1310.10 1328.28 1343.55 1372.74 1387.56 1395.72 1408.77 1409.56 1423.57 1430.77 1461.16 1468.35 1479.90 1491.65 1493.47 1497.50 1571.45 1583.59 1622.19 1673.34 1732.10 1830.99 1844.29 1862.12 2751.69 2898.21 3094.14 3099.78 3101.74 3112.82 3119.81 3145.08 3147.72 3156.44 3157.20 3181.24 3388.53 3528.05 3611.96 3660.45 3724.71 3785.12
formula: C10H18N3O6S
InChI: InChI=1S/C10H18N3O6S/c11-5(10(18)19)1-2-7(14)13-6(4-20)9(17)12-3-8(15)16/h5-6,12-13,15,18,20H,1-4H2,11H3
38 atoms
N  -1.755974 1.163007 2.310559
H  -2.630861 1.025463 2.797484
C  -0.586518 0.646635 2.997695
H  -0.845088 0.519468 4.05138
C  0.625476 1.566046 2.981338
O  1.742626 1.128661 3.138923
C  -1.950701 1.077716 0.935204
C  -0.717872 1.242442 0.031565
O  -3.055289 0.93816 0.476167
N  0.034812 -0.010945 -0.014668
H  -0.042824 1.977448 0.4651
C  -1.135602 1.739529 -1.347662
H  -0.456556 -0.881264 -0.138234
H  -0.279708 1.719225 -2.019731
H  -1.921133 1.10563 -1.756118
O  0.398064 2.858125 2.81991
H  -0.551275 3.00385 2.679191
H  -0.260637 -0.327124 2.631947
S  -1.810485 3.41465 -1.249167
H  -0.635916 4.051992 -1.322659
C  1.379147 0.005168 -0.059661
O  2.000208 1.071065 -0.088995
C  2.104565 -1.321536 0.00372
H  1.401225 -2.149678 -0.092964
H  2.780714 -1.372644 -0.852616
C  2.877026 -1.496944 1.326131
H  3.135621 -2.550806 1.42598
H  2.237817 -1.244035 2.174225
C  4.194614 -0.728048 1.478601
H  4.669054 -1.052928 2.407722
N  4.00896 0.747737 1.558296
H  3.376055 1.042589 0.768626
H  3.511043 1.023305 2.41262
C  5.201316 -0.971495 0.358931
O  5.81366 -0.083124 -0.167264
O  5.323727 -2.266914 0.078314
H  6.009134 -2.375347 -0.597028
H  4.906556 1.222117 1.467949
totalener: -1406.24175404 hartree
nucrepener: 1879.93113773 hartree
electener: -3286.17289177 hartree
oneelecener: -5642.93638600 hartree
twoeener: 2356.76349423 hartree
kineticenergy: 1400.65926820 hartree
exchangeener: -105.321702389412 hartree
correlationener: -7.054639893820 hartree
xcener: -112.376342283232 hartree
temp: 298.15 k
press: 1.00 atm
thermalcorrenthalpy: 0.00094421 hartree
totalenthalpy: -1405.99370689 hartree
totalentropycorr: -0.06538629 hartree
gibbsenthalpy: -1406.05909318 hartree
gibbsminuselec: 0.26413815 hartree
chargesum: 1.0000000
charge: -0.262251 0.196768 -0.088669 0.154019 0.360026 -0.407234 0.202333 0.044101 -0.262288 -0.203119 0.092435 -0.158145 0.194978 0.127340 0.134854 -0.202986 0.239595 0.106204 -0.127216 0.103610 0.267492 -0.411072 -0.181941 0.113004 0.126455 -0.182457 0.150864 0.117043 0.006144 0.152342 -0.075596 0.225084 0.234524 0.271152 -0.282415 -0.254298 0.255132 0.224187
charge: 0.291481 -0.010902 -0.056640 0.048609 -0.436425 0.105476 -0.377749 -0.145856 0.152055 0.357438 0.026461 -0.234170 -0.011264 0.008298 0.013934 0.413045 -0.088615 0.021681 0.506635 -0.149726 -0.355868 0.134096 0.002362 0.034673 0.041165 0.003962 0.044111 0.028809 -0.055621 0.050599 0.606783 -0.040239 0.007481 -0.442313 0.141577 0.393292 -0.065878 0.037244
qa: -0.2623 0.1968 -0.0887 0.1540 0.3600 -0.4072 0.2023 0.0441 -0.2623 -0.2031 0.0924 -0.1581 0.1950 0.1273 0.1349 -0.2030 0.2396 0.1062 -0.1272 0.1036 0.2675 -0.4111 -0.1819 0.1130 0.1265 -0.1825 0.1509 0.1170 0.0061 0.1523 -0.0756 0.2251 0.2345 0.2712 -0.2824 -0.2543 0.2551 0.2242
va: 3.0323 1.0099 3.8896 0.9917 4.1972 2.0978 4.2560 3.7059 2.2373 3.2061 1.0832 4.0114 1.0064 1.0063 1.0123 2.2747 1.0257 1.0181 2.1635 1.0211 4.1198 2.0864 3.8729 1.0138 1.0214 3.8543 1.0091 1.0334 3.8752 0.9999 3.6135 1.0858 1.0204 4.3833 2.2101 2.2485 1.0046 0.9937
dispcorr: -0.082037027 hartree
energy: -1406.329198809917
dipole: 4.53425 -2.29611 2.23814 -7.71179 5.34431 -2.36749 2.68995 -1.19247 1.49748
magnitude: 3.58563 au
magnitude: 9.11394 debye
zeropoint: 0.31136064 hartree
thermalvibcorrection: 0.01823874 hartree
thermalrotcorrection: 0.00141627 hartree
thermaltrasncorrection: 0.00141627 hartree
thermaltotal: -1405.99676688 hartree
thermalcorr: 0.02107128 hartree
nonthermalcorr: 0.31136064 hartree
totalcorr: 0.33243193 hartree
totalenthalpy: -1405.99582268 hartree
