program: Orca
programVersion: 5.0.2
elementType: N H C H C O C C O N H C H H H O H H S H C O C H H C H H C H N H H C O O H H
charge: 1
multiplicity: 1
keywords: wB97X-D3BJ Opt Freq def2-TZVPP def2/J RIJCOSX VeryTightSCF
keywords: PAL8 defgrid3 TightOpt
frequency: 0.00 0.00 0.00 0.00 0.00 0.00 35.42 40.66 53.00 78.73 85.71 98.84 104.25 119.59 132.37 134.69 154.63 160.64 175.21 207.92 218.81 235.48 251.59 270.93 303.78 310.41 339.89 346.06 390.59 412.99 441.43 457.68 485.22 519.82 558.00 569.94 583.48 596.81 611.74 626.90 666.53 694.97 724.76 740.29 747.91 770.81 815.59 830.83 851.15 885.17 889.85 892.10 916.78 925.73 961.75 966.82 998.47 1019.38 1044.73 1081.01 1092.38 1137.89 1151.46 1166.94 1172.02 1220.37 1225.63 1235.26 1247.25 1275.46 1287.93 1306.99 1334.57 1336.94 1362.08 1383.62 1384.64 1394.03 1408.15 1419.86 1438.61 1449.57 1460.74 1480.58 1490.47 1496.62 1498.71 1503.21 1512.37 1610.38 1616.28 1702.91 1714.22 1792.47 1823.82 1865.22 2697.64 2765.47 3095.38 3101.50 3102.24 3113.32 3119.75 3131.87 3149.28 3159.38 3161.51 3175.09 3257.58 3498.21 3570.04 3615.69 3644.34 3781.83
frequency: 35.42 40.66 53.00 78.73 85.71 98.84 104.25 119.59 132.37 134.69 154.63 160.64 175.21 207.92 218.81 235.48 251.59 270.93 303.78 310.41 339.89 346.06 390.59 412.99 441.43 457.68 485.22 519.82 558.00 569.94 583.48 596.81 611.74 626.90 666.53 694.97 724.76 740.29 747.91 770.81 815.59 830.83 851.15 885.17 889.85 892.10 916.78 925.73 961.75 966.82 998.47 1019.38 1044.73 1081.01 1092.38 1137.89 1151.46 1166.94 1172.02 1220.37 1225.63 1235.26 1247.25 1275.46 1287.93 1306.99 1334.57 1336.94 1362.08 1383.62 1384.64 1394.03 1408.15 1419.86 1438.61 1449.57 1460.74 1480.58 1490.47 1496.62 1498.71 1503.21 1512.37 1610.38 1616.28 1702.91 1714.22 1792.47 1823.82 1865.22 2697.64 2765.47 3095.38 3101.50 3102.24 3113.32 3119.75 3131.87 3149.28 3159.38 3161.51 3175.09 3257.58 3498.21 3570.04 3615.69 3644.34 3781.83
formula: C10H18N3O6S
InChI: InChI=1S/C10H18N3O6S/c11-5(10(18)19)1-2-7(14)13-6(4-20)9(17)12-3-8(15)16/h5-6,12-13,15,18,20H,1-4H2,11H3
38 atoms
N  0.110837 3.585394 -0.068137
H  0.150558 4.345546 0.592965
C  0.901604 3.729557 -1.268889
H  1.241396 4.766534 -1.323827
C  0.195804 3.467171 -2.585688
O  0.77077 3.018855 -3.557612
C  -0.232175 2.397351 0.520063
C  -0.444214 1.194846 -0.410601
O  -0.479498 2.303117 1.6992
N  0.29772 0.029832 0.049974
H  -0.116072 1.400581 -1.429552
C  -1.940826 0.889071 -0.411074
H  -0.209818 -0.842515 0.0791
H  -2.257766 0.686748 0.610692
H  -2.473053 1.76577 -0.777466
O  -1.086432 3.797197 -2.598655
H  -1.437932 3.625914 -3.484704
H  1.78792 3.09658 -1.249765
S  -2.271281 -0.548051 -1.473432
H  -3.420184 -0.905611 -0.890964
C  1.620918 0.01431 0.033788
O  2.283504 1.05909 -0.133601
C  2.342331 -1.309571 0.124569
H  3.167785 -1.178832 0.827499
H  1.700296 -2.091948 0.528286
C  2.863265 -1.76598 -1.25939
H  2.047147 -2.208754 -1.829837
H  3.608124 -2.548984 -1.105386
C  3.451067 -0.679369 -2.16125
H  4.017836 -1.141705 -2.972201
N  4.381334 0.227182 -1.407333
H  3.75265 0.709158 -0.689996
H  5.138908 -0.283875 -0.960556
C  2.367773 0.201159 -2.80745
O  1.238725 -0.174884 -2.950039
O  2.857393 1.37768 -3.178477
H  2.121842 1.982389 -3.464674
H  4.766003 0.937034 -2.029342
totalener: -1406.23914773 hartree
nucrepener: 1964.25075994 hartree
electener: -3370.48990767 hartree
oneelecener: -5812.15330130 hartree
twoeener: 2441.66339363 hartree
kineticenergy: 1401.46568497 hartree
exchangeener: -105.470775241372 hartree
correlationener: -7.068354346942 hartree
xcener: -112.539129588314 hartree
temp: 298.15 k
press: 1.00 atm
thermalcorrenthalpy: 0.00094421 hartree
totalenthalpy: -1405.99151386 hartree
totalentropycorr: -0.06750750 hartree
gibbsenthalpy: -1406.05902136 hartree
gibbsminuselec: 0.26411043 hartree
chargesum: 1.0000000
charge: -0.171319 0.186120 -0.105950 0.141351 0.337499 -0.339341 0.179708 0.082214 -0.301799 -0.111921 0.077781 -0.197585 0.168897 0.159165 0.124474 -0.231393 0.248703 0.118426 -0.157102 0.128147 0.307670 -0.462150 -0.231140 0.134736 0.121496 -0.199197 0.141949 0.133289 -0.018104 0.169203 -0.075219 0.230857 0.219747 0.300720 -0.277927 -0.336709 0.271617 0.233085
charge: 0.322718 -0.010598 -0.054183 0.046756 -0.428666 0.151220 -0.382677 -0.131550 0.121405 0.378059 0.023693 -0.218933 -0.019907 0.016843 0.011587 0.403873 -0.068272 0.019846 0.483116 -0.141344 -0.347051 0.120149 0.004824 0.034656 0.039429 0.007789 0.045928 0.032663 -0.049315 0.045856 0.598059 -0.041241 0.038172 -0.463552 0.151278 0.355904 -0.135387 0.038853
qa: -0.1713 0.1861 -0.1060 0.1414 0.3375 -0.3393 0.1797 0.0822 -0.3018 -0.1119 0.0778 -0.1976 0.1689 0.1592 0.1245 -0.2314 0.2487 0.1184 -0.1571 0.1281 0.3077 -0.4622 -0.2311 0.1347 0.1215 -0.1992 0.1419 0.1333 -0.0181 0.1692 -0.0752 0.2309 0.2197 0.3007 -0.2779 -0.3367 0.2716 0.2331
va: 3.0885 1.0164 3.8958 0.9939 4.1914 2.1534 4.3481 3.8060 2.2333 3.3309 1.0545 4.0087 1.0575 1.0083 1.0098 2.2914 1.0081 1.0315 2.1694 1.0163 4.0936 2.0320 3.8678 1.0125 1.0188 3.8374 1.0190 1.0023 3.8214 0.9936 3.5766 1.0787 0.9805 4.3610 2.2096 2.1806 1.0684 0.9886
dispcorr: -0.085228141 hartree
energy: -1406.328487306394
dipole: 9.04169 -5.52283 3.51886 -6.49172 5.38694 -1.10478 2.49189 -2.89235 -0.40046
magnitude: 3.70989 au
magnitude: 9.42978 debye
zeropoint: 0.31137440 hartree
thermalvibcorrection: 0.01776945 hartree
thermalrotcorrection: 0.00141627 hartree
thermaltrasncorrection: 0.00141627 hartree
thermaltotal: -1405.99651092 hartree
thermalcorr: 0.02060199 hartree
nonthermalcorr: 0.31137440 hartree
totalcorr: 0.33197639 hartree
totalenthalpy: -1405.99556671 hartree
