program: Orca
programVersion: 5.0.2
elementType: N H C H C O C C O N H C H H H O H H S H C O C H H C H H C H N H H C O O H H
charge: 1
multiplicity: 1
keywords: wB97X-D3BJ Opt Freq def2-TZVPP def2/J RIJCOSX VeryTightSCF
keywords: PAL8 defgrid3 TightOpt
frequency: 0.00 0.00 0.00 0.00 0.00 0.00 20.67 34.19 38.44 48.35 57.89 63.78 84.65 88.41 98.96 125.48 138.68 145.27 188.21 210.42 245.01 262.74 283.15 285.84 292.42 295.36 342.52 367.45 397.63 407.77 428.52 457.85 479.66 520.47 531.58 543.57 553.06 583.17 608.48 620.73 638.98 647.91 657.76 708.52 733.23 751.48 759.77 772.33 816.32 829.42 869.78 890.07 913.27 920.86 963.43 985.61 1004.40 1026.69 1049.14 1100.73 1125.52 1141.62 1161.49 1167.24 1171.05 1203.16 1218.72 1221.72 1237.69 1270.19 1287.55 1295.52 1324.19 1336.55 1341.42 1369.29 1389.10 1393.13 1405.71 1425.47 1432.11 1435.26 1438.37 1479.51 1485.06 1485.87 1494.63 1529.11 1571.82 1602.02 1622.44 1673.70 1722.10 1801.41 1813.63 1888.51 2751.09 2811.48 3082.47 3098.35 3101.65 3110.36 3117.86 3146.34 3151.80 3156.81 3173.47 3180.64 3380.93 3555.85 3637.34 3650.74 3788.85 3796.50
frequency: 20.67 34.19 38.44 48.35 57.89 63.78 84.65 88.41 98.96 125.48 138.68 145.27 188.21 210.42 245.01 262.74 283.15 285.84 292.42 295.36 342.52 367.45 397.63 407.77 428.52 457.85 479.66 520.47 531.58 543.57 553.06 583.17 608.48 620.73 638.98 647.91 657.76 708.52 733.23 751.48 759.77 772.33 816.32 829.42 869.78 890.07 913.27 920.86 963.43 985.61 1004.40 1026.69 1049.14 1100.73 1125.52 1141.62 1161.49 1167.24 1171.05 1203.16 1218.72 1221.72 1237.69 1270.19 1287.55 1295.52 1324.19 1336.55 1341.42 1369.29 1389.10 1393.13 1405.71 1425.47 1432.11 1435.26 1438.37 1479.51 1485.06 1485.87 1494.63 1529.11 1571.82 1602.02 1622.44 1673.70 1722.10 1801.41 1813.63 1888.51 2751.09 2811.48 3082.47 3098.35 3101.65 3110.36 3117.86 3146.34 3151.80 3156.81 3173.47 3180.64 3380.93 3555.85 3637.34 3650.74 3788.85 3796.50
formula: C10H18N3O6S
InChI: InChI=1S/C10H18N3O6S/c11-5(10(18)19)1-2-7(14)13-6(4-20)9(17)12-3-8(15)16/h5-6,12-13,15,18,20H,1-4H2,11H3
38 atoms
N  -1.38135 1.920166 2.045173
H  -2.104705 1.973165 2.746534
C  -0.01998 2.094851 2.473797
H  0.649946 2.246644 1.630937
C  0.545301 0.950871 3.300212
O  1.730049 0.694863 3.380277
C  -1.815977 1.393328 0.859534
C  -0.774084 1.195041 -0.253945
O  -2.976981 1.10038 0.684393
N  0.015068 0.003387 0.042458
H  -0.076754 2.030171 -0.279563
C  -1.463094 1.070423 -1.611125
H  -0.459932 -0.881869 -0.036993
H  -2.176756 0.246424 -1.593162
H  -2.037966 1.972103 -1.81366
O  -0.382569 0.278781 3.968135
H  0.045875 -0.387021 4.523906
H  0.057872 2.9874 3.102667
S  -0.312964 0.726278 -2.96005
H  0.299202 1.916434 -2.966081
C  1.353857 -0.000968 0.045579
O  2.003588 1.055533 0.029639
C  2.036022 -1.351347 0.080152
H  1.291057 -2.147849 0.067582
H  2.59903 -1.437467 -0.85198
C  2.960385 -1.596455 1.283021
H  3.275202 -2.638966 1.237583
H  2.412973 -1.468415 2.21837
C  4.249827 -0.778787 1.368708
H  4.848123 -1.167347 2.196851
N  3.984626 0.66275 1.65382
H  3.335397 1.016417 0.89466
H  3.447725 0.770925 2.522699
C  5.114953 -0.920734 0.118495
O  5.140711 -1.907618 -0.553042
O  5.861798 0.176052 -0.092289
H  6.421886 0.027039 -0.867539
H  4.845349 1.203598 1.681571
totalener: -1406.24814583 hartree
nucrepener: 1876.85265064 hartree
electener: -3283.10079646 hartree
oneelecener: -5637.14481443 hartree
twoeener: 2354.04401797 hartree
kineticenergy: 1400.66093401 hartree
exchangeener: -105.328110049994 hartree
correlationener: -7.054272158514 hartree
xcener: -112.382382208508 hartree
temp: 298.15 k
press: 1.00 atm
thermalcorrenthalpy: 0.00094421 hartree
totalenthalpy: -1405.99921425 hartree
totalentropycorr: -0.06557632 hartree
gibbsenthalpy: -1406.06479057 hartree
gibbsminuselec: 0.26381197 hartree
chargesum: 1.0000000
charge: -0.189041 0.196035 -0.081825 0.109940 0.361551 -0.414336 0.196037 -0.018789 -0.300997 -0.162781 0.129420 -0.134882 0.188004 0.129760 0.130243 -0.234770 0.241291 0.152388 -0.136406 0.100798 0.294821 -0.439794 -0.183913 0.106197 0.139937 -0.195713 0.155484 0.110011 0.009378 0.154027 -0.087750 0.224700 0.236946 0.273645 -0.250279 -0.286333 0.255527 0.221467
charge: 0.324920 -0.007210 -0.051219 0.029275 -0.418093 0.088188 -0.380662 -0.134881 0.120934 0.358972 0.029037 -0.240195 -0.003550 0.017268 0.018089 0.400704 -0.073286 0.045081 0.489506 -0.148616 -0.356453 0.119687 0.003679 0.036053 0.047047 0.004811 0.049106 0.027139 -0.054815 0.050479 0.598037 -0.054708 0.006598 -0.433751 0.166297 0.363697 -0.067451 0.030284
qa: -0.1890 0.1960 -0.0818 0.1099 0.3616 -0.4143 0.1960 -0.0188 -0.3010 -0.1628 0.1294 -0.1349 0.1880 0.1298 0.1302 -0.2348 0.2413 0.1524 -0.1364 0.1008 0.2948 -0.4398 -0.1839 0.1062 0.1399 -0.1957 0.1555 0.1100 0.0094 0.1540 -0.0878 0.2247 0.2369 0.2736 -0.2503 -0.2863 0.2555 0.2215
va: 3.1433 1.0136 3.8866 1.0353 4.1626 2.0452 4.3408 3.7809 2.2144 3.2207 1.0218 4.0196 1.0136 1.0173 1.0106 2.2825 1.0185 0.9904 2.1747 1.0250 4.0900 2.0478 3.8651 1.0181 1.0217 3.9028 1.0071 1.0277 3.8323 1.0007 3.5651 1.0911 1.0181 4.3714 2.2498 2.2002 1.0081 0.9910
dispcorr: -0.081229025 hartree
energy: -1406.333957201369
dipole: 4.20376 -1.34869 2.85507 -0.32253 0.47339 0.15086 3.68418 -1.37066 2.31353
magnitude: 3.67785 au
magnitude: 9.34835 debye
zeropoint: 0.31107111 hartree
thermalvibcorrection: 0.01832543 hartree
thermalrotcorrection: 0.00141627 hartree
thermaltrasncorrection: 0.00141627 hartree
thermaltotal: -1406.00172812 hartree
thermalcorr: 0.02115797 hartree
nonthermalcorr: 0.31107111 hartree
totalcorr: 0.33222908 hartree
totalenthalpy: -1406.00078391 hartree
