program: Orca
programVersion: 5.0.2
elementType: N H C H C O C C O N H C H H H O H H S H C O C H H C H H C H N H H C O O H H
charge: 1
multiplicity: 1
keywords: wB97X-D3BJ Opt Freq def2-TZVPP def2/J RIJCOSX VeryTightSCF
keywords: PAL8 defgrid3 TightOpt
frequency: 0.00 0.00 0.00 0.00 0.00 0.00 23.81 36.56 39.32 50.60 55.42 56.63 70.55 86.26 95.31 111.20 127.19 151.47 174.05 184.73 218.15 230.22 245.97 270.21 282.32 294.58 303.49 338.51 371.05 403.74 421.22 459.70 465.50 507.94 529.59 553.79 574.94 584.16 590.57 601.29 637.46 651.47 660.80 677.42 693.48 729.06 739.36 754.92 783.91 846.22 857.62 883.33 897.86 943.32 965.40 1000.65 1010.98 1037.52 1069.34 1075.83 1116.62 1131.43 1151.87 1171.67 1187.28 1195.01 1214.26 1247.77 1253.27 1257.05 1296.67 1311.76 1317.47 1323.52 1326.85 1346.32 1367.23 1390.00 1413.47 1415.46 1423.13 1435.00 1437.65 1472.43 1478.34 1490.76 1491.28 1526.09 1559.92 1580.62 1627.81 1677.84 1731.12 1803.96 1862.72 1892.14 2764.82 2837.64 3075.39 3080.90 3091.45 3123.39 3123.99 3124.84 3132.89 3134.10 3156.57 3182.44 3482.41 3546.39 3628.99 3645.08 3791.50 3831.66
frequency: 23.81 36.56 39.32 50.60 55.42 56.63 70.55 86.26 95.31 111.20 127.19 151.47 174.05 184.73 218.15 230.22 245.97 270.21 282.32 294.58 303.49 338.51 371.05 403.74 421.22 459.70 465.50 507.94 529.59 553.79 574.94 584.16 590.57 601.29 637.46 651.47 660.80 677.42 693.48 729.06 739.36 754.92 783.91 846.22 857.62 883.33 897.86 943.32 965.40 1000.65 1010.98 1037.52 1069.34 1075.83 1116.62 1131.43 1151.87 1171.67 1187.28 1195.01 1214.26 1247.77 1253.27 1257.05 1296.67 1311.76 1317.47 1323.52 1326.85 1346.32 1367.23 1390.00 1413.47 1415.46 1423.13 1435.00 1437.65 1472.43 1478.34 1490.76 1491.28 1526.09 1559.92 1580.62 1627.81 1677.84 1731.12 1803.96 1862.72 1892.14 2764.82 2837.64 3075.39 3080.90 3091.45 3123.39 3123.99 3124.84 3132.89 3134.10 3156.57 3182.44 3482.41 3546.39 3628.99 3645.08 3791.50 3831.66
formula: C10H18N3O6S
InChI: InChI=1S/C10H18N3O6S/c11-5(10(18)19)1-2-7(14)13-6(4-20)9(17)12-3-8(15)16/h5-6,12-13,15,18,20H,1-4H2,11H3
38 atoms
N  -0.971099 1.308221 2.459579
H  -1.074087 1.961266 3.22053
C  -0.98845 -0.086856 2.784701
H  -1.558695 -0.229458 3.708239
C  0.388286 -0.69818 3.001394
O  1.424996 -0.088187 2.98709
C  -1.011272 1.938826 1.244145
C  -0.821974 1.190457 -0.089119
O  -1.203186 3.132183 1.181825
N  -0.011827 -0.013417 -0.056924
H  -0.2902 1.930343 -0.687788
C  -2.167763 0.93647 -0.774398
H  -0.480893 -0.901124 -0.150308
H  -2.772834 1.836207 -0.679199
H  -2.011436 0.750261 -1.834908
O  0.403761 -2.025251 3.194163
H  -0.48581 -2.39626 3.223997
H  -1.510469 -0.665347 2.02022
S  -3.107793 -0.460113 -0.082644
H  -3.002117 -1.28444 -1.129276
C  1.328476 0.041331 -0.01041
O  1.919608 1.121874 0.057183
C  2.060623 -1.288316 -0.045129
H  1.655491 -1.943172 0.730881
H  1.8289 -1.763775 -1.002239
C  3.579024 -1.176176 0.088328
H  3.97309 -0.469271 -0.646167
H  4.016441 -2.148923 -0.135542
C  4.078789 -0.797831 1.486862
H  3.548891 -1.387802 2.235714
N  3.81753 0.647291 1.804391
H  4.68746 1.174981 1.850105
H  3.168516 1.033967 1.065261
C  5.558517 -1.14662 1.625071
O  5.981023 -2.241667 1.410758
O  6.307535 -0.096681 2.011131
H  7.228917 -0.383658 2.083422
H  3.31398 0.727771 2.687692
totalener: -1406.23689519 hartree
nucrepener: 1881.28174631 hartree
electener: -3287.51864150 hartree
oneelecener: -5645.86655245 hartree
twoeener: 2358.34791094 hartree
kineticenergy: 1400.65289523 hartree
exchangeener: -105.323837501641 hartree
correlationener: -7.055101460181 hartree
xcener: -112.378938961821 hartree
temp: 298.15 k
press: 1.00 atm
thermalcorrenthalpy: 0.00094421 hartree
totalenthalpy: -1405.98963580 hartree
totalentropycorr: -0.06587387 hartree
gibbsenthalpy: -1406.05550968 hartree
gibbsminuselec: 0.26304696 hartree
chargesum: 1.0000000
charge: -0.175730 0.191025 -0.151107 0.174277 0.337538 -0.374945 0.165845 0.050997 -0.298861 -0.197151 0.140883 -0.153304 0.157683 0.153955 0.138027 -0.226413 0.232697 0.093749 -0.154485 0.120245 0.261689 -0.399164 -0.177708 0.112062 0.150183 -0.225345 0.134768 0.145003 0.009288 0.136504 -0.060972 0.218286 0.226330 0.292012 -0.253431 -0.287115 0.253268 0.239414
charge: 0.327895 -0.006778 -0.080957 0.043103 -0.430178 0.113528 -0.379041 -0.132326 0.118555 0.344372 0.052306 -0.215070 -0.033760 0.024471 0.013478 0.387517 -0.086643 0.005109 0.502750 -0.148868 -0.354375 0.136760 -0.008381 0.034047 0.043849 0.006382 0.036712 0.046436 -0.045017 0.045876 0.605125 0.021750 -0.046121 -0.428551 0.165830 0.361154 -0.067414 0.026477
qa: -0.1757 0.1910 -0.1511 0.1743 0.3375 -0.3749 0.1658 0.0510 -0.2989 -0.1972 0.1409 -0.1533 0.1577 0.1540 0.1380 -0.2264 0.2327 0.0937 -0.1545 0.1202 0.2617 -0.3992 -0.1777 0.1121 0.1502 -0.2253 0.1348 0.1450 0.0093 0.1365 -0.0610 0.2183 0.2263 0.2920 -0.2534 -0.2871 0.2533 0.2394
va: 3.0697 1.0177 3.7989 0.9889 4.1938 2.1110 4.3927 3.7327 2.2369 3.1544 1.0379 3.9031 1.0630 1.0130 0.9963 2.2434 1.0126 1.0829 2.1849 1.0168 4.1230 2.0925 3.8063 1.0228 0.9992 3.9361 1.0082 1.0216 3.8058 1.0276 3.5680 1.0057 1.0853 4.3445 2.2527 2.1891 1.0079 0.9910
dispcorr: -0.082222601 hartree
energy: -1406.324695114309
dipole: 0.49457 0.64857 1.14315 -3.44242 2.00011 -1.44231 -3.98868 4.36961 0.38093
magnitude: 1.87940 au
magnitude: 4.77706 debye
zeropoint: 0.31007284 hartree
thermalvibcorrection: 0.01882418 hartree
thermalrotcorrection: 0.00141627 hartree
thermaltrasncorrection: 0.00141627 hartree
thermaltotal: -1405.99296555 hartree
thermalcorr: 0.02165673 hartree
nonthermalcorr: 0.31007284 hartree
totalcorr: 0.33172957 hartree
totalenthalpy: -1405.99202134 hartree
