program: Orca
programVersion: 5.0.2
elementType: N H C H C O C C O N H C H H H O H H S H C O C H H C H H C H N H H C O O H H
charge: 1
multiplicity: 1
keywords: wB97X-D3BJ Opt Freq def2-TZVPP def2/J RIJCOSX VeryTightSCF
keywords: PAL8 defgrid3 TightOpt
frequency: 0.00 0.00 0.00 0.00 0.00 0.00 27.40 30.45 49.98 55.52 59.66 77.22 89.86 92.73 113.32 123.93 130.68 142.33 161.82 186.42 198.88 224.27 255.53 270.29 275.25 300.51 308.46 343.08 357.31 382.14 421.99 447.86 474.74 481.20 518.62 529.98 553.95 599.16 616.78 645.46 658.50 683.45 695.29 708.68 753.34 763.03 788.87 805.56 825.03 853.36 885.10 887.24 905.21 960.19 988.74 995.18 1018.71 1038.98 1046.12 1059.38 1080.57 1091.82 1136.69 1163.22 1179.75 1204.13 1204.44 1216.14 1247.29 1268.61 1290.15 1294.12 1308.70 1354.03 1357.74 1369.41 1390.82 1401.86 1415.22 1418.00 1428.50 1443.46 1451.14 1479.71 1485.07 1490.05 1506.65 1514.29 1530.96 1552.02 1637.14 1674.99 1710.89 1806.78 1876.62 1891.29 2761.68 2797.98 3069.57 3075.96 3100.04 3105.62 3130.43 3133.41 3144.37 3156.32 3185.51 3199.36 3425.15 3508.78 3544.91 3628.52 3672.37 3793.15
frequency: 27.40 30.45 49.98 55.52 59.66 77.22 89.86 92.73 113.32 123.93 130.68 142.33 161.82 186.42 198.88 224.27 255.53 270.29 275.25 300.51 308.46 343.08 357.31 382.14 421.99 447.86 474.74 481.20 518.62 529.98 553.95 599.16 616.78 645.46 658.50 683.45 695.29 708.68 753.34 763.03 788.87 805.56 825.03 853.36 885.10 887.24 905.21 960.19 988.74 995.18 1018.71 1038.98 1046.12 1059.38 1080.57 1091.82 1136.69 1163.22 1179.75 1204.13 1204.44 1216.14 1247.29 1268.61 1290.15 1294.12 1308.70 1354.03 1357.74 1369.41 1390.82 1401.86 1415.22 1418.00 1428.50 1443.46 1451.14 1479.71 1485.07 1490.05 1506.65 1514.29 1530.96 1552.02 1637.14 1674.99 1710.89 1806.78 1876.62 1891.29 2761.68 2797.98 3069.57 3075.96 3100.04 3105.62 3130.43 3133.41 3144.37 3156.32 3185.51 3199.36 3425.15 3508.78 3544.91 3628.52 3672.37 3793.15
formula: C10H18N3O6S
InChI: InChI=1S/C10H18N3O6S/c11-5(10(18)19)1-2-7(14)13-6(4-20)9(17)12-3-8(15)16/h5-6,12-13,15,18,20H,1-4H2,11H3
38 atoms
N  -3.092687 0.826571 1.016664
H  -3.741148 0.622162 1.762962
C  -3.601105 0.744525 -0.339922
H  -2.827103 0.426559 -1.03147
C  -4.241217 2.009676 -0.893559
O  -4.224066 2.292398 -2.056229
C  -1.819881 0.919297 1.433136
C  -0.670849 1.309463 0.495039
O  -1.549404 0.652766 2.610399
N  -0.057697 0.055708 0.036335
H  0.046965 1.786164 1.166395
C  -0.925818 2.330423 -0.611806
H  -0.530329 -0.805495 0.249572
H  0.034973 2.504958 -1.095824
H  -1.617457 2.007262 -1.384046
O  -4.864933 2.719825 0.059378
H  -5.278984 3.484672 -0.36465
H  -4.37648 -0.025448 -0.3609
S  -1.392585 3.937934 0.067839
H  -2.556017 3.573342 0.618166
C  1.305934 0.013126 -0.056952
O  1.976704 1.012343 -0.185495
C  1.971438 -1.357285 0.074464
H  1.254366 -2.131417 0.36426
H  2.355168 -1.632155 -0.909587
C  3.162981 -1.250879 1.037427
H  3.695898 -0.328276 0.802511
H  3.865602 -2.073421 0.872586
C  2.830646 -1.196351 2.532934
H  3.729569 -0.962906 3.10124
N  2.343438 -2.551823 3.012972
H  1.349752 -2.634105 2.778126
H  2.873036 -3.313468 2.589488
C  1.749665 -0.160231 2.871562
O  2.002085 1.001085 2.964705
O  0.555422 -0.740107 2.981667
H  -0.208288 -0.066387 2.960365
H  2.412291 -2.631848 4.027962
totalener: -1406.20137527 hartree
nucrepener: 1882.72630075 hartree
electener: -3288.92767603 hartree
oneelecener: -5650.04655708 hartree
twoeener: 2361.11888105 hartree
kineticenergy: 1400.60269520 hartree
exchangeener: -105.306695828494 hartree
correlationener: -7.053788207756 hartree
xcener: -112.360484036250 hartree
temp: 298.15 k
press: 1.00 atm
thermalcorrenthalpy: 0.00094421 hartree
totalenthalpy: -1405.95549699 hartree
totalentropycorr: -0.06571089 hartree
gibbsenthalpy: -1406.02120788 hartree
gibbsminuselec: 0.26202904 hartree
chargesum: 1.0000000
charge: -0.143474 0.202677 -0.115348 0.132524 0.277746 -0.260972 0.198946 0.038427 -0.373610 -0.205061 0.153535 -0.161719 0.155198 0.153439 0.100434 -0.277464 0.250344 0.143097 -0.118236 0.092568 0.194714 -0.315563 -0.166248 0.067520 0.145707 -0.208130 0.161669 0.110247 -0.009950 0.188566 -0.063597 0.236332 0.234364 0.258320 -0.215625 -0.376666 0.267355 0.247931
charge: 0.348881 0.002401 -0.041297 0.032779 -0.462649 0.146463 -0.344071 -0.142580 0.147209 0.322363 0.047369 -0.239860 -0.036544 0.021633 -0.004323 0.363418 -0.076184 0.042754 0.512382 -0.160588 -0.393870 0.132024 -0.006531 0.010809 0.045330 0.000715 0.055032 0.027891 -0.034008 0.048507 0.613314 0.037595 0.052328 -0.477951 0.184348 0.323016 -0.159671 0.061566
qa: -0.1435 0.2027 -0.1153 0.1325 0.2777 -0.2610 0.1989 0.0384 -0.3736 -0.2051 0.1535 -0.1617 0.1552 0.1534 0.1004 -0.2775 0.2503 0.1431 -0.1182 0.0926 0.1947 -0.3156 -0.1662 0.0675 0.1457 -0.2081 0.1617 0.1102 -0.0099 0.1886 -0.0636 0.2363 0.2344 0.2583 -0.2156 -0.3767 0.2674 0.2479
va: 3.1624 1.0071 3.8592 1.0146 4.3165 2.2346 4.2522 3.6819 2.1245 3.1374 1.0408 3.9691 1.0289 1.0131 1.0250 2.2008 1.0093 0.9946 2.1671 1.0421 4.2837 2.1994 3.8888 1.0200 1.0067 3.9181 1.0234 1.0045 3.7401 0.9898 3.6236 1.0019 0.9732 4.4363 2.3052 2.1107 1.0919 0.9663
dispcorr: -0.082869671 hartree
energy: -1406.289613474639
dipole: 8.97955 -6.92147 2.05808 -15.95053 9.66511 -6.28542 1.18090 1.08237 2.26327
magnitude: 6.99032 au
magnitude: 17.76797 debye
zeropoint: 0.31022297 hartree
thermalvibcorrection: 0.01859482 hartree
thermalrotcorrection: 0.00141627 hartree
thermaltrasncorrection: 0.00141627 hartree
thermaltotal: -1405.95796315 hartree
thermalcorr: 0.02142736 hartree
nonthermalcorr: 0.31022297 hartree
totalcorr: 0.33165033 hartree
totalenthalpy: -1405.95701894 hartree
