program: Orca
programVersion: 5.0.2
elementType: N H C H C O C C O N H C H H H O H H S H C O C H H C H H C H N H H C O O H H
charge: 1
multiplicity: 1
keywords: wB97X-D3BJ Opt Freq def2-TZVPP def2/J RIJCOSX VeryTightSCF
keywords: PAL8 defgrid3 TightOpt
frequency: 0.00 0.00 0.00 0.00 0.00 0.00 23.09 31.26 34.57 56.35 68.91 79.58 84.90 107.94 116.48 131.82 146.98 177.48 195.68 219.97 228.39 244.07 252.58 271.56 289.19 298.47 318.86 321.48 346.30 358.25 409.99 434.93 491.31 526.13 528.51 555.40 590.75 610.96 627.64 635.05 650.56 666.99 690.06 710.16 742.63 759.22 804.35 807.83 826.90 855.63 864.80 897.15 919.60 927.78 979.81 997.34 1006.26 1024.10 1041.71 1063.56 1088.97 1114.77 1138.99 1147.34 1153.06 1203.97 1218.03 1249.33 1257.00 1287.74 1290.38 1296.49 1302.42 1340.07 1357.19 1365.20 1372.53 1379.79 1399.05 1400.41 1430.37 1456.20 1468.03 1474.02 1477.78 1481.50 1491.85 1506.27 1538.16 1582.48 1638.48 1672.09 1726.94 1784.08 1829.90 1881.82 2755.16 2951.57 3072.55 3078.69 3090.96 3110.50 3126.01 3134.34 3140.83 3146.60 3158.23 3170.67 3217.28 3507.62 3570.80 3633.67 3661.37 3793.59
frequency: 23.09 31.26 34.57 56.35 68.91 79.58 84.90 107.94 116.48 131.82 146.98 177.48 195.68 219.97 228.39 244.07 252.58 271.56 289.19 298.47 318.86 321.48 346.30 358.25 409.99 434.93 491.31 526.13 528.51 555.40 590.75 610.96 627.64 635.05 650.56 666.99 690.06 710.16 742.63 759.22 804.35 807.83 826.90 855.63 864.80 897.15 919.60 927.78 979.81 997.34 1006.26 1024.10 1041.71 1063.56 1088.97 1114.77 1138.99 1147.34 1153.06 1203.97 1218.03 1249.33 1257.00 1287.74 1290.38 1296.49 1302.42 1340.07 1357.19 1365.20 1372.53 1379.79 1399.05 1400.41 1430.37 1456.20 1468.03 1474.02 1477.78 1481.50 1491.85 1506.27 1538.16 1582.48 1638.48 1672.09 1726.94 1784.08 1829.90 1881.82 2755.16 2951.57 3072.55 3078.69 3090.96 3110.50 3126.01 3134.34 3140.83 3146.60 3158.23 3170.67 3217.28 3507.62 3570.80 3633.67 3661.37 3793.59
formula: C10H18N3O6S
InChI: InChI=1S/C10H18N3O6S/c11-5(10(18)19)1-2-7(14)13-6(4-20)9(17)12-3-8(15)16/h5-6,12-13,15,18,20H,1-4H2,11H3
38 atoms
N  -2.603382 1.339473 -1.96934
H  -2.764878 1.357925 -2.965296
C  -3.761095 1.24114 -1.105279
H  -3.642111 1.876016 -0.225669
C  -4.120208 -0.160115 -0.63532
O  -5.204546 -0.456549 -0.229246
C  -1.306567 1.269289 -1.636836
C  -0.917052 1.205912 -0.152568
O  -0.446415 1.281639 -2.52096
N  0.004247 0.093196 0.058717
H  -1.794128 0.981993 0.449467
C  -0.382787 2.569205 0.304976
H  -0.4273 -0.8161 0.042592
H  0.000767 2.475256 1.319815
H  0.432199 2.910923 -0.322293
O  -3.083074 -1.032641 -0.682729
H  -3.431246 -1.879212 -0.370149
H  -4.628611 1.624092 -1.639724
S  -1.689636 3.820728 0.368021
H  -1.643436 4.177116 -0.9207
C  1.358166 0.134937 0.00591
O  2.016755 1.156715 -0.06949
C  2.056536 -1.224976 0.055862
H  2.05877 -1.569866 1.092819
H  1.508173 -1.962185 -0.532577
C  3.505239 -1.08561 -0.408418
H  4.073797 -1.968942 -0.109015
H  3.921761 -0.213376 0.10169
C  3.693928 -0.892105 -1.922555
H  3.596066 -1.838661 -2.453745
N  5.067483 -0.327732 -2.18406
H  4.855094 0.647587 -2.505922
H  5.646855 -0.309316 -1.347081
C  2.76083 0.142102 -2.572574
O  3.210011 1.198559 -2.956003
O  1.540409 -0.297795 -2.654298
H  0.844117 0.431285 -2.729086
H  5.568602 -0.814933 -2.923985
totalener: -1406.22624625 hartree
nucrepener: 1886.51134698 hartree
electener: -3292.73759322 hartree
oneelecener: -5658.11817555 hartree
twoeener: 2365.38058233 hartree
kineticenergy: 1400.62951545 hartree
exchangeener: -105.322639066054 hartree
correlationener: -7.057920951956 hartree
xcener: -112.380560018011 hartree
temp: 298.15 k
press: 1.00 atm
thermalcorrenthalpy: 0.00094421 hartree
totalenthalpy: -1405.98031160 hartree
totalentropycorr: -0.06497581 hartree
gibbsenthalpy: -1406.04528742 hartree
gibbsminuselec: 0.26241343 hartree
chargesum: 1.0000000
charge: -0.127825 0.196728 -0.092839 0.126011 0.276572 -0.260304 0.169038 0.077227 -0.407621 -0.198938 0.121066 -0.126307 0.171658 0.136901 0.152012 -0.292840 0.235138 0.152520 -0.148422 0.113305 0.200661 -0.375647 -0.184085 0.140487 0.116658 -0.229541 0.141880 0.122806 -0.000273 0.150757 -0.057966 0.234136 0.228192 0.327612 -0.301408 -0.293707 0.271913 0.234449
charge: 0.350314 -0.000925 -0.045878 0.024086 -0.434625 0.148758 -0.344591 -0.134923 0.148763 0.336728 0.029086 -0.230997 -0.019235 0.017831 0.009259 0.339386 -0.085505 0.046431 0.510034 -0.147439 -0.392725 0.102090 -0.003873 0.039908 0.028880 -0.008432 0.029183 0.032166 -0.033836 0.040191 0.613034 0.020093 0.045479 -0.461851 0.149943 0.397357 -0.162450 0.048285
qa: -0.1278 0.1967 -0.0928 0.1260 0.2766 -0.2603 0.1690 0.0772 -0.4076 -0.1989 0.1211 -0.1263 0.1717 0.1369 0.1520 -0.2928 0.2351 0.1525 -0.1484 0.1133 0.2007 -0.3756 -0.1841 0.1405 0.1167 -0.2295 0.1419 0.1228 -0.0003 0.1508 -0.0580 0.2341 0.2282 0.3276 -0.3014 -0.2937 0.2719 0.2344
va: 3.1396 1.0093 3.7943 1.0419 4.2842 2.2477 4.3404 3.7803 2.1098 3.1881 1.0214 3.9077 1.0262 1.0042 1.0194 2.1495 1.0195 1.0026 2.1767 1.0226 4.3030 2.1063 3.8662 1.0004 1.0158 3.8807 0.9985 1.0304 3.8054 1.0077 3.6248 1.0393 0.9801 4.3498 2.2048 2.2241 1.0672 0.9750
dispcorr: -0.081625205 hartree
energy: -1406.313787138246
dipole: 13.44712 -8.66125 4.78587 -6.90036 3.92125 -2.97911 1.53248 -2.40533 -0.87285
magnitude: 5.70452 au
magnitude: 14.49973 debye
zeropoint: 0.31022812 hartree
thermalvibcorrection: 0.01828046 hartree
thermalrotcorrection: 0.00141627 hartree
thermaltrasncorrection: 0.00141627 hartree
thermaltotal: -1405.98244601 hartree
thermalcorr: 0.02111300 hartree
nonthermalcorr: 0.31022812 hartree
totalcorr: 0.33134112 hartree
totalenthalpy: -1405.98150181 hartree
