program: Orca
programVersion: 5.0.2
elementType: N H C H C O C C O N H C H H H O H H S H C O C H H C H H C H N H H C O O H H
charge: 1
multiplicity: 1
keywords: wB97X-D3BJ Opt Freq def2-TZVPP def2/J RIJCOSX VeryTightSCF
keywords: PAL8 defgrid3 TightOpt
frequency: 0.00 0.00 0.00 0.00 0.00 0.00 23.32 31.69 67.70 72.42 79.09 84.17 89.12 94.38 117.27 149.48 150.42 160.84 174.68 178.49 185.54 191.61 225.72 242.95 277.49 291.07 305.93 323.18 338.35 369.47 412.80 441.72 464.57 505.99 511.57 526.58 578.46 584.57 615.70 620.23 629.09 637.85 688.99 722.38 740.57 752.08 799.87 822.12 849.21 870.96 892.49 900.08 906.09 926.82 956.10 985.85 990.73 996.76 1018.21 1071.30 1084.30 1108.33 1133.46 1145.16 1166.58 1217.00 1222.65 1249.82 1258.52 1274.62 1285.19 1293.08 1304.16 1331.51 1367.59 1370.81 1379.76 1387.98 1401.67 1427.78 1432.98 1438.49 1456.25 1475.24 1485.95 1494.57 1498.85 1507.82 1508.71 1587.71 1641.96 1671.72 1750.93 1799.18 1821.65 1881.25 2765.68 3069.62 3090.70 3104.80 3107.82 3111.99 3122.13 3139.35 3153.50 3167.64 3177.99 3188.19 3419.26 3505.67 3542.24 3642.27 3643.47 3831.12
frequency: 23.32 31.69 67.70 72.42 79.09 84.17 89.12 94.38 117.27 149.48 150.42 160.84 174.68 178.49 185.54 191.61 225.72 242.95 277.49 291.07 305.93 323.18 338.35 369.47 412.80 441.72 464.57 505.99 511.57 526.58 578.46 584.57 615.70 620.23 629.09 637.85 688.99 722.38 740.57 752.08 799.87 822.12 849.21 870.96 892.49 900.08 906.09 926.82 956.10 985.85 990.73 996.76 1018.21 1071.30 1084.30 1108.33 1133.46 1145.16 1166.58 1217.00 1222.65 1249.82 1258.52 1274.62 1285.19 1293.08 1304.16 1331.51 1367.59 1370.81 1379.76 1387.98 1401.67 1427.78 1432.98 1438.49 1456.25 1475.24 1485.95 1494.57 1498.85 1507.82 1508.71 1587.71 1641.96 1671.72 1750.93 1799.18 1821.65 1881.25 2765.68 3069.62 3090.70 3104.80 3107.82 3111.99 3122.13 3139.35 3153.50 3167.64 3177.99 3188.19 3419.26 3505.67 3542.24 3642.27 3643.47 3831.12
formula: C10H18N3O6S
InChI: InChI=1S/C10H18N3O6S/c11-5(10(18)19)1-2-7(14)13-6(4-20)9(17)12-3-8(15)16/h5-6,12-13,15,18,20H,1-4H2,11H3
38 atoms
N  -0.850276 3.310837 0.303133
H  -0.688539 3.947898 1.067998
C  -0.583964 3.801965 -1.029512
H  -1.209359 3.321578 -1.777904
C  0.867784 3.637239 -1.450948
O  1.209552 3.153115 -2.511147
C  -0.856296 2.000257 0.700651
C  -1.063328 0.933986 -0.386468
O  -0.804777 1.685865 1.866705
N  -0.186911 -0.194178 -0.144957
H  -0.845172 1.325922 -1.381834
C  -2.522762 0.488303 -0.310025
H  -0.588917 -1.114713 -0.22262
H  -2.721766 0.108405 0.691172
H  -3.166834 1.347134 -0.495641
O  1.708327 4.111519 -0.543641
H  2.615626 3.932493 -0.8187
H  -0.814607 4.868903 -1.053155
S  -2.828894 -0.807427 -1.546377
H  -3.938473 -1.298534 -0.985524
C  1.140697 -0.030642 -0.158248
O  1.670943 1.074397 -0.217399
C  1.979617 -1.301952 -0.109237
H  2.047561 -1.618339 0.933984
H  1.485618 -2.1049 -0.660385
C  3.390614 -1.044667 -0.632986
H  4.045029 -1.86932 -0.336268
H  3.756603 -0.123099 -0.172918
C  3.470547 -0.903749 -2.158355
H  3.283153 -1.85362 -2.657462
N  4.87711 -0.468819 -2.512039
H  4.95047 0.533462 -2.309275
H  5.574524 -0.982215 -1.972738
C  2.497701 0.138986 -2.714339
O  1.368998 -0.150759 -2.97872
O  3.075866 1.332039 -2.82356
H  2.386563 2.052318 -2.863234
H  5.075141 -0.591172 -3.505605
totalener: -1406.21147846 hartree
nucrepener: 1971.65718621 hartree
electener: -3377.86866467 hartree
oneelecener: -5828.07891429 hartree
twoeener: 2450.21024962 hartree
kineticenergy: 1400.61447776 hartree
exchangeener: -105.322730340262 hartree
correlationener: -7.062231900127 hartree
xcener: -112.384962240389 hartree
temp: 298.15 k
press: 1.00 atm
thermalcorrenthalpy: 0.00094421 hartree
totalenthalpy: -1405.96993070 hartree
totalentropycorr: -0.06425378 hartree
gibbsenthalpy: -1406.03418449 hartree
gibbsminuselec: 0.26196147 hartree
chargesum: 1.0000000
charge: -0.194138 0.191232 -0.065559 0.124889 0.350781 -0.366356 0.192601 0.065313 -0.312894 -0.152747 0.109806 -0.201584 0.158304 0.152127 0.117255 -0.228045 0.226075 0.144141 -0.162170 0.120159 0.266841 -0.451423 -0.189701 0.144583 0.118056 -0.209088 0.121434 0.127045 0.017890 0.172005 -0.063669 0.241141 0.237128 0.292052 -0.245854 -0.355244 0.262242 0.245371
charge: 0.321757 -0.010317 -0.048615 0.033497 -0.409751 0.154366 -0.385417 -0.140418 0.113713 0.354024 0.025400 -0.220912 -0.030520 0.015597 0.009643 0.407320 -0.083432 0.043830 0.475594 -0.143777 -0.382454 0.072455 0.006928 0.044729 0.034255 -0.008548 0.028430 0.033934 -0.036128 0.045519 0.614857 0.048246 0.054863 -0.467720 0.171264 0.344874 -0.147627 0.060538
qa: -0.1941 0.1912 -0.0656 0.1249 0.3508 -0.3664 0.1926 0.0653 -0.3129 -0.1527 0.1098 -0.2016 0.1583 0.1521 0.1173 -0.2280 0.2261 0.1441 -0.1622 0.1202 0.2668 -0.4514 -0.1897 0.1446 0.1181 -0.2091 0.1214 0.1270 0.0179 0.1720 -0.0637 0.2411 0.2371 0.2921 -0.2459 -0.3552 0.2622 0.2454
va: 3.1117 1.0170 3.8700 1.0089 4.1925 2.1495 4.3210 3.7970 2.2324 3.2696 1.0276 4.0263 1.0580 1.0068 1.0087 2.2769 1.0323 0.9954 2.1591 1.0191 4.2190 2.0486 3.9187 0.9981 1.0103 3.9364 1.0066 1.0273 3.7330 1.0026 3.6430 0.9974 0.9701 4.4043 2.2570 2.1397 1.0880 0.9679
dispcorr: -0.082152702 hartree
energy: -1406.309528196949
dipole: 8.26848 -3.02838 5.24009 -6.65468 4.97280 -1.68188 -0.08547 -1.64907 -1.73454
magnitude: 5.77026 au
magnitude: 14.66683 debye
zeropoint: 0.31049336 hartree
thermalvibcorrection: 0.01862458 hartree
thermalrotcorrection: 0.00141627 hartree
thermaltrasncorrection: 0.00141627 hartree
thermaltotal: -1405.97757772 hartree
thermalcorr: 0.02145712 hartree
nonthermalcorr: 0.31049336 hartree
totalcorr: 0.33195047 hartree
totalenthalpy: -1405.97663351 hartree
