program: Gaussian 09
title: 000047368
version: EM64L-G09RevD.01
frameworkgroup: C1[X(C10H8Cl2N2O2)]
method: RPBEPBE
basis: SDD
operation: Freq
keyword: #p
keyword: freq=noraman
keyword: PBEPBE/SDD
title: #p freq=noraman PBEPBE/SDD
converged: NO YES NO NO
title: Mulliken charges:
elementType: Cl Cl O O N N C C C C C C C C C C H H H H H H H H
charge: -0.059691 -0.028881 -0.226727 -0.223638 -0.407928 -0.393693 0.031685 0.632047 0.156420 -0.678666 0.167109 -0.322838 -0.364455 -0.216885 -0.227059 -0.109809 0.345494 0.255378 0.237855 0.240430 0.355163 0.287633 0.286261 0.264796
chargesum: 0.00000
title: Mulliken charges with hydrogens summed into heavy atoms:
elementType: Cl Cl O O N N C C C C C C C C C C
charge: -0.059691 -0.028881 -0.226727 -0.223638 -0.062434 -0.038530 0.031685 0.632047 0.156420 0.054997 0.167109 -0.322838 -0.076822 0.069377 0.037737 -0.109809
polarizability: 1.90978310e+02 9.75911560e+00 1.44361069e+02 -3.35866062e+00 -3.55782375e+00 9.32403237e+01
1716.lowfreq: -3.8709 -0.0005 0.0012 0.0024 3.5961 8.9463 36.6469 62.4376 93.9058
frequency: 36.6237 62.4217 93.8989 128.7917 163.9345 167.0376 184.6063 195.7618 212.3530 224.0966 255.6759 272.0879 341.2581 370.9522 381.4117 423.7416 437.5680 459.4078 513.3910 542.5111 565.7814 603.0049 617.1076 649.5318 655.8486 679.9395 712.1725 720.7035 744.6859 753.5777 835.0578 864.8999 866.5575 946.8935 968.3509 974.3066 1010.5694 1065.1960 1093.4857 1096.1877 1134.0422 1155.0341 1210.3076 1233.5011 1275.0001 1308.8029 1318.2887 1340.5743 1361.3703 1377.2712 1390.2548 1457.6766 1466.4749 1474.0462 1561.5859 1592.3067 1674.0842 1724.9517 2999.2310 3102.7904 3114.9967 3162.0894 3180.3869 3184.5330 3584.7659 3587.6760
redmass: 13.6708 6.0114 6.2512 9.1562 6.6383 8.7195 14.6779 4.5108 6.2326 1.0803 7.5437 4.1068 5.4742 10.9434 7.0864 4.6892 5.6774 4.8405 6.2113 1.1388 3.8345 9.6663 4.5059 1.4693 6.7677 3.3655 6.4808 4.1269 6.4240 7.0374 1.3828 2.8174 1.4105 2.1893 1.6042 2.2888 3.8588 3.7912 2.3384 2.5331 2.3235 1.8101 2.8805 3.4651 1.3456 2.3151 3.5945 3.0921 2.0227 3.8928 1.2937 1.7941 1.2211 1.0747 7.8638 7.0590 8.4510 9.5060 1.0345 1.1009 1.1012 1.0891 1.0961 1.0942 1.0789 1.0815
irintensity: 0.1144 1.4223 0.5950 0.9994 0.4600 3.7320 0.3590 0.8499 0.7140 0.5520 1.4428 2.8254 1.5672 6.4064 17.3862 1.5572 11.2207 11.5365 8.6142 107.5589 15.1157 15.2880 1.3834 138.2531 4.6179 15.6618 25.5701 4.3487 40.5135 85.8662 33.9107 8.4145 20.1197 5.8994 2.3721 8.7384 61.1266 11.9679 28.5950 19.6359 9.6935 8.5431 23.6870 91.0445 4.1924 128.6428 83.9967 58.1628 28.6733 12.0105 18.8963 70.9800 34.0403 16.6412 22.8573 50.0658 440.8454 515.4996 11.8217 18.5523 4.7537 4.3887 3.6550 0.8172 117.0007 41.5897
temp: 298.150 k
press: 1.00000 atm
elementType: 17 17 8 8 7 7 6 6 6 6 6 6 6 6 6 6 1 1 1 1 1 1 1 1
symmnumber: 1
zpe: 435820.1 jmol-1
zpe.correction: 0.165995 hartree
zpe.thermalcorrener: 0.180458 hartree
zpe.thermalcorrenthalpy: 0.181403 hartree
zpe.thermalcorrgfe: 0.123941 hartree
zpe.sumelectzpe: -1564.828690 hartree
zpe.sumelectthermal: -1564.814227 hartree
zpe.sumelectthermalent: -1564.813282 hartree
zpe.sumelectthermalfe: -1564.870744 hartree
dipole: -1.1161 -0.0372 1.5765
dipole: 1.9319
quadrupole: -116.1043 -106.1881 -112.3204
quadrupole: -3.7540 6.8637 7.7148
quadrupole: -4.5667 5.3495 -0.7828 -3.7540 6.8637 7.7148
hfenergy: -1564.9946848 hartree
pointgroup: C01 [X(C10H8Cl2N2O2)]
dipole: 0.4636264 -0.042298 0.6008201 debye
dipolederiv: -0.2822328 -0.1848199 0.0236727 -0.2206307 -0.6458759 0.0215557 0.0190858 -0.0004533 -0.0786253 -0.852036 -0.1186751 0.1552829 -0.0892727 -0.1300206 0.0134767 0.1747732 0.021682 -0.0858671 -0.5728234 0.034355 -0.0820065 -0.0623573 -0.8494648 -0.3568696 -0.1291937 -0.2973671 -0.6183862 -0.9322775 -0.0939022 -0.4427582 -0.1912821 -0.5459735 -0.2429792 -0.6225565 -0.1721254 -0.8533869 -1.1844064 0.1513745 -0.2296709 0.2532657 -0.4757243 0.145673 -0.304928 0.1348492 -0.6978351 -0.6827378 -0.2599527 -0.384226 -0.0556139 -0.8017732 -0.3283141 -0.3540125 -0.4550853 -0.8193721 0.4918107 0.1443556 -0.0047535 0.4008296 -0.0544502 0.1439745 0.1318794 0.0315833 0.4282403 0.0845538 -0.1286512 -0.0510406 0.0793369 -0.3019026 -0.0361327 -0.0656507 0.017573 -0.0962735 0.9089965 0.0643608 0.5771581 -0.159091 0.9261312 0.360776 0.572963 0.4916508 0.8769726 -0.1366276 0.0162034 0.0204901 -0.0595265 0.0048633 0.0214449 -0.0263229 -0.0333978 -0.0543927 1.4292295 -0.1030419 0.7577303 -0.1202672 1.282786 0.4328739 1.0213566 0.3698635 1.1695661 0.3018315 0.3147522 -0.0728155 0.1955298 0.9689177 -0.0158544 -0.0740155 0.0019734 -0.0380979 -0.0446576 0.0735073 -0.0287383 0.0626689 0.0153794 -0.0104773 -0.0379398 0.0131374 -0.0828122 -0.4332293 -0.1596223 0.0676542 -0.1834833 -0.2594861 0.040009 0.0808118 0.0220719 -0.0683836 -0.3654386 0.0354259 0.0580625 0.0370329 0.0284594 0.005994 0.0851912 0.0041382 -0.1041891 1.2691295 0.1507184 -0.2730338 0.183719 0.2150049 -0.0214 -0.2976969 -0.0151589 -0.0016939 0.3906927 0.0377756 -0.0715078 -0.0353433 0.2158262 -0.058335 -0.0700438 -0.026545 0.2443873 0.0829329 -0.047981 -0.0448648 -0.0395591 0.0189507 -0.086452 -0.0828949 -0.0261081 0.0157404 -0.1300915 -0.0388271 0.0631657 -0.0473054 0.0966782 0.0237871 0.0714993 0.0089702 0.058907 0.0646259 0.0865105 -0.0275762 0.0772475 -0.0299394 0.048033 -0.0379581 0.0061254 0.0810926 0.2908885 0.0146019 -0.0675815 -0.0239961 0.2136163 -0.0789443 -0.0769854 -0.0576603 0.2656856 0.1603811 0.0305164 0.0180486 0.0191816 0.0512149 -0.0029248 -0.0204227 -0.0180614 0.1355177 0.076967 0.030831 0.0221294 0.0339193 0.0540604 -0.0165573 0.0235495 -0.0170171 0.1624212 0.0645187 -0.049815 0.0171792 -0.0550026 0.002722 -0.0023571 0.0195114 -0.0046385 0.1607849 unknown
polarizability: 190.5675354|11.0588264|143.5081927|0.5309659|8.8938732|94.5039749 unknown
InChI: InChI=1S/C10H8Cl2N2O2/c1-10(8(15)13-9(16)14-10)6-3-2-5(11)4-7(6)12/h2-4,13-14H,1H3
charge 0 multiplicity 1
24 atoms
Cl 0.676969 -2.870402 0.005892
Cl 4.945594 0.524968 -0.753295
O  -1.706002 2.157863 1.190719
O  -3.615456 -0.78504 -1.952209
N  -1.800184 -1.028158 -0.427062
N  -2.855153 0.945068 -0.483131
C  -1.079717 -0.214261 0.579873
C  0.418952 -0.035404 0.231949
C  -1.882272 1.131185 0.49017
C  -1.240759 -0.762086 2.027619
C  -2.836911 -0.368447 -1.065471
C  1.280393 -1.130514 -0.033496
C  1.021226 1.251549 0.203981
C  2.647195 -0.986295 -0.336723
C  2.387624 1.439377 -0.092397
C  3.184433 0.313612 -0.36421
H  -1.551091 -1.990808 -0.651132
H  -0.852223 -0.017739 2.742993
H  -2.306972 -0.944739 2.247594
H  -0.686674 -1.706404 2.152707
H  -3.547191 1.645874 -0.750258
H  0.409716 2.126761 0.438733
H  3.268773 -1.860743 -0.542303
H  2.818129 2.444183 -0.106645
