program: Orca
programVersion: 5.0.2
elementType: N H C H C O C C O N H C H H H O H H S H C O C H H C H H C H N H H C O O H H
charge: 1
multiplicity: 1
keywords: wB97X-D3BJ Opt Freq def2-TZVPP def2/J RIJCOSX VeryTightSCF
keywords: PAL8 defgrid3 TightOpt
frequency: 0.00 0.00 0.00 0.00 0.00 0.00 1.03 18.30 27.22 30.45 43.81 59.36 66.54 81.34 84.53 108.86 111.75 116.66 133.93 172.67 189.76 198.67 223.08 241.97 278.34 283.04 297.27 338.71 350.86 396.10 413.46 439.90 477.42 512.69 516.50 557.55 589.59 602.19 621.53 625.94 644.78 653.65 664.70 683.47 718.81 735.11 753.02 758.95 806.03 840.57 872.51 878.10 921.17 941.71 963.57 982.95 1001.35 1001.93 1027.10 1071.63 1088.15 1107.85 1142.79 1149.47 1151.82 1212.26 1213.61 1214.00 1244.78 1248.17 1269.24 1284.42 1292.70 1312.28 1328.33 1346.13 1357.23 1371.28 1376.80 1389.84 1420.73 1447.63 1455.92 1482.72 1484.73 1490.01 1500.17 1510.26 1522.34 1567.30 1647.21 1672.16 1776.57 1788.66 1839.79 1888.14 2764.16 3052.05 3078.03 3095.23 3101.97 3118.34 3133.58 3136.63 3161.58 3167.93 3186.57 3214.34 3501.45 3557.50 3600.75 3630.71 3755.62 3773.67
frequency: 1.03 18.30 27.22 30.45 43.81 59.36 66.54 81.34 84.53 108.86 111.75 116.66 133.93 172.67 189.76 198.67 223.08 241.97 278.34 283.04 297.27 338.71 350.86 396.10 413.46 439.90 477.42 512.69 516.50 557.55 589.59 602.19 621.53 625.94 644.78 653.65 664.70 683.47 718.81 735.11 753.02 758.95 806.03 840.57 872.51 878.10 921.17 941.71 963.57 982.95 1001.35 1001.93 1027.10 1071.63 1088.15 1107.85 1142.79 1149.47 1151.82 1212.26 1213.61 1214.00 1244.78 1248.17 1269.24 1284.42 1292.70 1312.28 1328.33 1346.13 1357.23 1371.28 1376.80 1389.84 1420.73 1447.63 1455.92 1482.72 1484.73 1490.01 1500.17 1510.26 1522.34 1567.30 1647.21 1672.16 1776.57 1788.66 1839.79 1888.14 2764.16 3052.05 3078.03 3095.23 3101.97 3118.34 3133.58 3136.63 3161.58 3167.93 3186.57 3214.34 3501.45 3557.50 3600.75 3630.71 3755.62 3773.67
formula: C10H18N3O6S
InChI: InChI=1S/C10H18N3O6S/c11-5(10(18)19)1-2-7(14)13-6(4-20)9(17)12-3-8(15)16/h5-6,12-13,15,18,20H,1-4H2,11H3
38 atoms
N  -3.27398 1.46691 -0.009946
H  -4.178957 1.02443 0.052703
C  -3.193595 2.872521 0.330357
H  -3.90948 3.099834 1.120499
C  -3.479299 3.858495 -0.809279
O  -3.553295 5.030882 -0.589216
C  -2.263762 0.573497 -0.165307
C  -0.823439 1.102623 -0.262027
O  -2.482459 -0.619958 -0.269216
N  0.017049 -0.075326 -0.285399
H  -0.575141 1.69497 0.622576
C  -0.600793 1.980249 -1.500609
H  -0.478555 -0.942859 -0.437509
H  -1.102227 2.938441 -1.388101
H  0.466515 2.167614 -1.594098
O  -3.624429 3.351468 -2.040523
H  -3.461785 2.397443 -2.051239
H  -2.211062 3.121413 0.729082
S  -1.239275 1.12938 -2.973584
H  -1.093369 2.162281 -3.810125
C  1.344588 -0.01832 -0.090165
O  1.956487 1.006966 0.152762
C  2.074409 -1.358839 -0.223465
H  1.471634 -2.141991 0.249674
H  2.131134 -1.59912 -1.289899
C  3.473188 -1.241774 0.371965
H  3.424913 -1.050509 1.448694
H  3.967307 -0.373534 -0.06287
C  4.348411 -2.460971 0.10685
H  4.388912 -2.691439 -0.958243
N  3.832621 -3.680663 0.837365
H  4.540178 -3.872087 1.574179
H  2.923135 -3.509609 1.26391
C  5.766123 -2.278958 0.650425
O  6.17185 -2.944431 1.571612
O  6.425775 -1.336774 0.011523
H  7.309557 -1.2323 0.395769
H  3.758328 -4.501107 0.237947
totalener: -1406.20906600 hartree
nucrepener: 1734.83557986 hartree
electener: -3141.04464586 hartree
oneelecener: -5354.62702868 hartree
twoeener: 2213.58238282 hartree
kineticenergy: 1400.60342587 hartree
exchangeener: -105.309083315563 hartree
correlationener: -7.049813982766 hartree
xcener: -112.358897298329 hartree
temp: 298.15 k
press: 1.00 atm
thermalcorrenthalpy: 0.00094421 hartree
totalenthalpy: -1405.95752044 hartree
totalentropycorr: -0.06711636 hartree
gibbsenthalpy: -1406.02463680 hartree
gibbsminuselec: 0.26163413 hartree
chargesum: 1.0000000
charge: -0.235140 0.208771 -0.111562 0.148483 0.260098 -0.268463 0.215853 0.074447 -0.352774 -0.208446 0.120684 -0.215794 0.175700 0.130507 0.147385 -0.224432 0.216471 0.119954 -0.169362 0.134519 0.252098 -0.378798 -0.216903 0.084788 0.132258 -0.206752 0.129914 0.145722 0.010739 0.158921 -0.049366 0.237387 0.235976 0.308501 -0.294221 -0.224789 0.264961 0.242665
charge: 0.327909 -0.006317 -0.054383 0.040724 -0.465094 0.144100 -0.392396 -0.132084 0.095122 0.342441 0.036608 -0.221811 -0.032788 0.004075 0.008551 0.379561 -0.131868 0.034110 0.491817 -0.139391 -0.390788 0.085935 -0.016246 0.015803 0.037108 -0.008453 0.040194 0.051918 -0.037169 0.046795 0.619610 0.031485 0.049549 -0.429497 0.149144 0.423876 -0.053230 0.055082
qa: -0.2351 0.2088 -0.1116 0.1485 0.2601 -0.2685 0.2159 0.0744 -0.3528 -0.2084 0.1207 -0.2158 0.1757 0.1305 0.1474 -0.2244 0.2165 0.1200 -0.1694 0.1345 0.2521 -0.3788 -0.2169 0.0848 0.1323 -0.2068 0.1299 0.1457 0.0107 0.1589 -0.0494 0.2374 0.2360 0.3085 -0.2942 -0.2248 0.2650 0.2427
va: 3.0965 1.0019 3.8242 1.0027 4.3546 2.2527 4.3099 3.8316 2.1593 3.2082 1.0147 3.9674 1.0535 1.0091 1.0167 2.2059 1.0533 1.0110 2.1643 1.0138 4.2793 2.1347 3.8341 1.0241 1.0044 3.8267 1.0097 1.0391 3.8062 1.0050 3.6265 1.0233 0.9779 4.3379 2.1970 2.3072 0.9962 0.9703
dispcorr: -0.077738539 hartree
energy: -1406.292670929636
dipole: 8.48801 -3.00561 5.48240 -9.07898 2.78254 -6.29645 3.53443 -1.80902 1.72541
magnitude: 8.52520 au
magnitude: 21.66933 debye
zeropoint: 0.30927885 hartree
thermalvibcorrection: 0.01941036 hartree
thermalrotcorrection: 0.00141627 hartree
thermaltrasncorrection: 0.00141627 hartree
thermaltotal: -1405.96114918 hartree
thermalcorr: 0.02224290 hartree
nonthermalcorr: 0.30927885 hartree
totalcorr: 0.33152175 hartree
totalenthalpy: -1405.96020497 hartree
