program: Orca
programVersion: 5.0.2
elementType: N H C H C O C C O N H C H H H O H H S H C O C H H C H H C H N H H C O O H H
charge: 1
multiplicity: 1
keywords: wB97X-D3BJ Opt Freq def2-TZVPP def2/J RIJCOSX VeryTightSCF
keywords: PAL8 defgrid3 TightOpt
frequency: 0.00 0.00 0.00 0.00 0.00 0.00 35.87 45.01 47.68 59.57 65.38 77.32 81.71 98.65 115.99 125.49 132.93 161.42 178.87 181.23 201.42 206.59 225.74 235.84 242.72 262.77 313.04 343.51 369.20 407.37 420.64 455.48 465.71 506.55 531.07 537.67 574.36 589.59 638.27 658.66 676.77 693.16 695.81 717.60 743.67 769.29 787.17 833.09 840.31 887.48 900.79 912.82 924.37 953.48 963.73 992.14 1002.96 1020.28 1032.17 1059.42 1066.95 1103.87 1138.00 1159.08 1187.36 1218.14 1221.26 1237.32 1248.12 1260.85 1264.52 1307.48 1315.08 1340.81 1345.72 1353.86 1379.18 1390.65 1400.63 1407.42 1422.61 1456.42 1469.99 1480.03 1488.08 1488.66 1496.34 1522.09 1531.39 1547.92 1639.14 1677.25 1778.59 1791.74 1811.44 1813.82 2769.50 3075.45 3081.44 3089.47 3106.87 3107.54 3117.03 3125.36 3140.62 3148.18 3160.17 3173.18 3213.13 3502.49 3561.59 3594.16 3642.93 3794.58
frequency: 35.87 45.01 47.68 59.57 65.38 77.32 81.71 98.65 115.99 125.49 132.93 161.42 178.87 181.23 201.42 206.59 225.74 235.84 242.72 262.77 313.04 343.51 369.20 407.37 420.64 455.48 465.71 506.55 531.07 537.67 574.36 589.59 638.27 658.66 676.77 693.16 695.81 717.60 743.67 769.29 787.17 833.09 840.31 887.48 900.79 912.82 924.37 953.48 963.73 992.14 1002.96 1020.28 1032.17 1059.42 1066.95 1103.87 1138.00 1159.08 1187.36 1218.14 1221.26 1237.32 1248.12 1260.85 1264.52 1307.48 1315.08 1340.81 1345.72 1353.86 1379.18 1390.65 1400.63 1407.42 1422.61 1456.42 1469.99 1480.03 1488.08 1488.66 1496.34 1522.09 1531.39 1547.92 1639.14 1677.25 1778.59 1791.74 1811.44 1813.82 2769.50 3075.45 3081.44 3089.47 3106.87 3107.54 3117.03 3125.36 3140.62 3148.18 3160.17 3173.18 3213.13 3502.49 3561.59 3594.16 3642.93 3794.58
formula: C10H18N3O6S
InChI: InChI=1S/C10H18N3O6S/c11-5(10(18)19)1-2-7(14)13-6(4-20)9(17)12-3-8(15)16/h5-6,12-13,15,18,20H,1-4H2,11H3
38 atoms
N  -0.560192 1.841034 2.242167
H  -0.554544 2.666505 2.827337
C  -1.177211 0.69097 2.866122
H  -2.263115 0.774894 2.955657
C  -0.605389 0.487352 4.2493
O  0.48313 0.877071 4.62242
C  -0.729315 2.231279 0.928597
C  -0.71567 1.221852 -0.232292
O  -0.819479 3.402301 0.642364
N  0.00343 -0.01882 0.000739
H  -0.172377 1.784432 -0.993921
C  -2.112145 0.963306 -0.7949
H  -0.502278 -0.886355 -0.080766
H  -2.62486 1.919371 -0.880008
H  -2.017177 0.522835 -1.786552
O  -1.435808 -0.176329 5.039065
H  -1.011688 -0.299467 5.899942
H  -0.965639 -0.22041 2.305342
S  -3.057182 -0.174787 0.263853
H  -4.021012 -0.450562 -0.619508
C  1.359516 -0.001586 0.018514
O  1.997402 1.030671 0.042876
C  2.064729 -1.359573 -0.045354
H  1.434198 -2.145064 0.381044
H  2.176663 -1.589695 -1.107417
C  3.453566 -1.274582 0.595788
H  3.810812 -0.25023 0.476976
H  4.170196 -1.924245 0.08588
C  3.48813 -1.606895 2.088434
H  4.452179 -1.348923 2.522688
N  3.245193 -3.084642 2.29876
H  2.238294 -3.144602 2.549268
H  3.447208 -3.632308 1.464308
C  2.341758 -0.94209 2.858547
O  1.346336 -1.602112 3.106597
O  2.561158 0.299074 3.143013
H  1.776021 0.691577 3.627891
H  3.787772 -3.459418 3.07561
totalener: -1406.21616069 hartree
nucrepener: 1922.05776008 hartree
electener: -3328.27392078 hartree
oneelecener: -5728.73349700 hartree
twoeener: 2400.45957623 hartree
kineticenergy: 1400.63077688 hartree
exchangeener: -105.314998153049 hartree
correlationener: -7.054720295917 hartree
xcener: -112.369718448966 hartree
temp: 298.15 k
press: 1.00 atm
thermalcorrenthalpy: 0.00094421 hartree
totalenthalpy: -1405.96951205 hartree
totalentropycorr: -0.06574107 hartree
gibbsenthalpy: -1406.03525312 hartree
gibbsminuselec: 0.26227507 hartree
chargesum: 1.0000000
charge: -0.204075 0.179229 -0.115429 0.163041 0.338079 -0.347870 0.201744 0.047268 -0.292220 -0.233843 0.139511 -0.170462 0.164629 0.144767 0.134563 -0.228882 0.242400 0.114190 -0.187419 0.128728 0.220453 -0.334534 -0.177673 0.086215 0.142083 -0.210844 0.154453 0.120268 -0.007784 0.176931 -0.061339 0.234733 0.230008 0.319933 -0.387915 -0.237203 0.273063 0.241205
charge: 0.299005 -0.008975 -0.072348 0.028129 -0.409013 0.156623 -0.372144 -0.140547 0.128011 0.324702 0.053542 -0.215532 -0.040526 0.018726 0.008037 0.405514 -0.072376 0.024503 0.475111 -0.141613 -0.398050 0.119251 -0.011454 0.015513 0.042680 0.000067 0.049380 0.027633 -0.031994 0.044494 0.613649 0.022440 0.048290 -0.455430 0.110367 0.429596 -0.129509 0.054247
qa: -0.2041 0.1792 -0.1154 0.1630 0.3381 -0.3479 0.2017 0.0473 -0.2922 -0.2338 0.1395 -0.1705 0.1646 0.1448 0.1346 -0.2289 0.2424 0.1142 -0.1874 0.1287 0.2205 -0.3345 -0.1777 0.0862 0.1421 -0.2108 0.1545 0.1203 -0.0078 0.1769 -0.0613 0.2347 0.2300 0.3199 -0.3879 -0.2372 0.2731 0.2412
va: 3.0240 1.0240 3.8349 1.0057 4.2690 2.1382 4.3203 3.7722 2.2348 3.1192 1.0325 3.9759 1.0437 1.0141 0.9970 2.2927 1.0160 1.0192 2.1512 1.0170 4.2781 2.1866 3.8382 1.0213 0.9969 3.8561 1.0335 1.0032 3.8977 0.9954 3.6098 1.0242 0.9779 4.2739 2.1040 2.3384 1.0704 0.9711
dispcorr: -0.082386579 hartree
energy: -1406.303573708332
dipole: 6.59564 -3.76757 2.82806 -12.00944 6.30206 -5.70737 -6.55181 7.19602 0.64421
magnitude: 6.40211 au
magnitude: 16.27288 debye
zeropoint: 0.31020736 hartree
thermalvibcorrection: 0.01854494 hartree
thermalrotcorrection: 0.00141627 hartree
thermaltrasncorrection: 0.00141627 hartree
thermaltotal: -1405.97198886 hartree
thermalcorr: 0.02137748 hartree
nonthermalcorr: 0.31020736 hartree
totalcorr: 0.33158485 hartree
totalenthalpy: -1405.97104465 hartree
