program: Orca
programVersion: 5.0.2
elementType: N H C H C O C C O N H C H H H O H H S H C O C H H C H H C H N H H C O O H H
charge: 1
multiplicity: 1
keywords: wB97X-D3BJ Opt Freq def2-TZVPP def2/J RIJCOSX VeryTightSCF
keywords: PAL8 defgrid3 TightOpt
frequency: 0.00 0.00 0.00 0.00 0.00 0.00 23.73 32.37 37.48 39.17 54.20 62.17 78.48 95.16 99.29 124.00 151.41 164.80 178.51 211.96 216.53 232.55 242.41 257.54 271.45 288.03 314.61 343.30 354.96 374.85 410.81 426.69 467.27 498.90 518.99 525.68 562.69 564.64 604.21 621.91 637.04 642.53 662.34 681.67 705.17 730.08 755.40 769.11 807.41 844.17 872.49 887.56 889.99 937.56 964.77 997.51 1029.50 1047.97 1071.60 1101.03 1117.85 1135.65 1139.77 1167.28 1191.40 1205.34 1210.20 1216.89 1251.63 1260.04 1299.70 1307.11 1315.33 1323.73 1339.75 1359.95 1365.77 1385.86 1399.47 1408.82 1418.27 1434.87 1450.71 1468.35 1476.33 1491.84 1492.79 1520.53 1556.32 1572.75 1610.33 1680.63 1743.26 1814.43 1819.48 1892.92 2756.88 3001.24 3081.86 3082.93 3092.46 3095.90 3124.66 3126.45 3126.66 3139.27 3159.49 3174.53 3384.32 3525.81 3634.96 3657.87 3790.75 3802.21
frequency: 23.73 32.37 37.48 39.17 54.20 62.17 78.48 95.16 99.29 124.00 151.41 164.80 178.51 211.96 216.53 232.55 242.41 257.54 271.45 288.03 314.61 343.30 354.96 374.85 410.81 426.69 467.27 498.90 518.99 525.68 562.69 564.64 604.21 621.91 637.04 642.53 662.34 681.67 705.17 730.08 755.40 769.11 807.41 844.17 872.49 887.56 889.99 937.56 964.77 997.51 1029.50 1047.97 1071.60 1101.03 1117.85 1135.65 1139.77 1167.28 1191.40 1205.34 1210.20 1216.89 1251.63 1260.04 1299.70 1307.11 1315.33 1323.73 1339.75 1359.95 1365.77 1385.86 1399.47 1408.82 1418.27 1434.87 1450.71 1468.35 1476.33 1491.84 1492.79 1520.53 1556.32 1572.75 1610.33 1680.63 1743.26 1814.43 1819.48 1892.92 2756.88 3001.24 3081.86 3082.93 3092.46 3095.90 3124.66 3126.45 3126.66 3139.27 3159.49 3174.53 3384.32 3525.81 3634.96 3657.87 3790.75 3802.21
formula: C10H18N3O6S
InChI: InChI=1S/C10H18N3O6S/c11-5(10(18)19)1-2-7(14)13-6(4-20)9(17)12-3-8(15)16/h5-6,12-13,15,18,20H,1-4H2,11H3
38 atoms
N  -0.312573 1.71013 2.397214
H  -0.167093 2.446402 3.071142
C  -0.79715 0.46109 2.912225
H  -1.414849 0.626388 3.79959
C  0.287556 -0.520619 3.316683
O  1.48399 -0.352413 3.23043
C  -0.434514 2.222157 1.123515
C  -0.713954 1.285559 -0.061275
O  -0.320552 3.409717 0.932226
N  0.025123 0.02687 0.034975
H  -0.353929 1.844409 -0.924934
C  -2.211175 1.017719 -0.242858
H  -0.460849 -0.843967 -0.103651
H  -2.339663 0.270653 -1.029509
H  -2.666984 0.619081 0.664781
O  -0.252118 -1.636071 3.799249
H  0.448376 -2.229326 4.10297
H  -1.442993 -0.052633 2.203663
S  -3.13374 2.454983 -0.82729
H  -2.70352 3.317355 0.101191
C  1.369973 0.040003 0.040032
O  1.983521 1.107736 0.038985
C  2.07822 -1.303089 0.065215
H  1.681048 -1.904006 0.887266
H  1.821346 -1.830955 -0.857265
C  3.599448 -1.187549 0.15433
H  3.963843 -0.492293 -0.605539
H  4.042233 -2.158883 -0.064162
C  4.14895 -0.776682 1.524494
H  3.758525 -1.443683 2.29499
N  3.74418 0.618385 1.90852
H  4.545188 1.158534 2.231095
H  3.273121 1.068934 1.087666
C  5.666998 -0.946693 1.542052
O  6.202313 -1.95719 1.202554
O  6.306232 0.148372 1.993062
H  7.258419 -0.024834 1.993688
H  3.017133 0.577527 2.631759
totalener: -1406.23778177 hartree
nucrepener: 1859.92774287 hartree
electener: -3266.16552465 hartree
oneelecener: -5603.13018708 hartree
twoeener: 2336.96466243 hartree
kineticenergy: 1400.64844516 hartree
exchangeener: -105.322843865419 hartree
correlationener: -7.053556022024 hartree
xcener: -112.376399887443 hartree
temp: 298.15 k
press: 1.00 atm
thermalcorrenthalpy: 0.00094421 hartree
totalenthalpy: -1405.98924045 hartree
totalentropycorr: -0.06597033 hartree
gibbsenthalpy: -1406.05521078 hartree
gibbsminuselec: 0.26290807 hartree
chargesum: 1.0000000
charge: -0.205843 0.188458 -0.074141 0.171236 0.320895 -0.396944 0.137190 0.072254 -0.280259 -0.236123 0.149499 -0.173053 0.182636 0.119975 0.121244 -0.232105 0.242246 0.102991 -0.111650 0.120898 0.268934 -0.395196 -0.192144 0.112447 0.154946 -0.222119 0.139167 0.146099 0.002584 0.131034 -0.055278 0.218475 0.228902 0.289467 -0.250794 -0.286726 0.254410 0.236388
charge: 0.315265 -0.011237 -0.059717 0.046853 -0.418342 0.100096 -0.390553 -0.130401 0.124272 0.342558 0.047697 -0.253332 -0.017056 0.012485 -0.003661 0.399156 -0.076077 0.030904 0.508216 -0.140845 -0.356702 0.137687 -0.008616 0.031311 0.044990 0.005663 0.038958 0.046479 -0.044795 0.043306 0.608039 0.019629 -0.032229 -0.427628 0.168239 0.363204 -0.066345 0.002529
qa: -0.2058 0.1885 -0.0741 0.1712 0.3209 -0.3969 0.1372 0.0723 -0.2803 -0.2361 0.1495 -0.1731 0.1826 0.1200 0.1212 -0.2321 0.2422 0.1030 -0.1116 0.1209 0.2689 -0.3952 -0.1921 0.1124 0.1549 -0.2221 0.1392 0.1461 0.0026 0.1310 -0.0553 0.2185 0.2289 0.2895 -0.2508 -0.2867 0.2544 0.2364
va: 3.0124 1.0179 3.8244 1.0003 4.2412 2.0577 4.3787 3.6458 2.2396 3.1936 1.0413 3.9965 1.0121 0.9974 0.9981 2.2683 1.0159 1.0420 2.1713 1.0311 4.1249 2.1007 3.8292 1.0100 0.9976 3.9278 1.0077 1.0217 3.8360 1.0239 3.5594 1.0065 1.0670 4.3369 2.2541 2.1889 1.0061 1.0215
dispcorr: -0.081011106 hartree
energy: -1406.323383834147
dipole: 0.70463 0.99394 1.69857 -6.18217 3.98983 -2.19234 0.58156 1.23899 1.82056
magnitude: 3.31752 au
magnitude: 8.43246 debye
zeropoint: 0.31003389 hartree
thermalvibcorrection: 0.01878788 hartree
thermalrotcorrection: 0.00141627 hartree
thermaltrasncorrection: 0.00141627 hartree
thermaltotal: -1405.99172953 hartree
thermalcorr: 0.02162042 hartree
nonthermalcorr: 0.31003389 hartree
totalcorr: 0.33165431 hartree
totalenthalpy: -1405.99078532 hartree
