program: Orca
programVersion: 5.0.2
elementType: N H C H C O C C O N H C H H H O H H S H C O C H H C H H C H N H H C O O H H
charge: 1
multiplicity: 1
keywords: wB97X-D3BJ Opt Freq def2-TZVPP def2/J RIJCOSX VeryTightSCF
keywords: PAL8 defgrid3 TightOpt
frequency: 0.00 0.00 0.00 0.00 0.00 0.00 19.41 24.89 35.70 38.86 55.41 69.39 80.33 106.85 112.31 138.90 162.17 180.69 186.59 196.05 210.34 234.66 244.87 255.31 277.00 310.51 317.03 343.93 362.84 390.49 419.51 434.26 470.96 497.24 520.62 528.61 556.96 587.00 615.83 621.94 640.61 660.40 675.95 702.86 710.45 736.73 761.72 800.41 805.69 863.93 878.68 897.00 901.09 943.04 975.99 1024.49 1034.68 1037.95 1055.43 1110.68 1115.70 1138.12 1157.24 1170.48 1183.99 1205.48 1211.55 1227.32 1243.90 1273.46 1281.24 1299.42 1314.08 1318.34 1329.70 1361.06 1374.34 1379.37 1394.93 1418.48 1426.26 1453.95 1471.34 1478.16 1481.76 1496.68 1498.97 1531.67 1553.06 1575.84 1630.01 1666.61 1724.05 1749.64 1851.35 1886.41 2752.02 3019.94 3086.20 3093.76 3094.25 3095.06 3115.02 3135.09 3136.65 3146.34 3155.21 3160.34 3366.63 3419.07 3628.54 3674.40 3785.93 3800.65
frequency: 19.41 24.89 35.70 38.86 55.41 69.39 80.33 106.85 112.31 138.90 162.17 180.69 186.59 196.05 210.34 234.66 244.87 255.31 277.00 310.51 317.03 343.93 362.84 390.49 419.51 434.26 470.96 497.24 520.62 528.61 556.96 587.00 615.83 621.94 640.61 660.40 675.95 702.86 710.45 736.73 761.72 800.41 805.69 863.93 878.68 897.00 901.09 943.04 975.99 1024.49 1034.68 1037.95 1055.43 1110.68 1115.70 1138.12 1157.24 1170.48 1183.99 1205.48 1211.55 1227.32 1243.90 1273.46 1281.24 1299.42 1314.08 1318.34 1329.70 1361.06 1374.34 1379.37 1394.93 1418.48 1426.26 1453.95 1471.34 1478.16 1481.76 1496.68 1498.97 1531.67 1553.06 1575.84 1630.01 1666.61 1724.05 1749.64 1851.35 1886.41 2752.02 3019.94 3086.20 3093.76 3094.25 3095.06 3115.02 3135.09 3136.65 3146.34 3155.21 3160.34 3366.63 3419.07 3628.54 3674.40 3785.93 3800.65
formula: C10H18N3O6S
InChI: InChI=1S/C10H18N3O6S/c11-5(10(18)19)1-2-7(14)13-6(4-20)9(17)12-3-8(15)16/h5-6,12-13,15,18,20H,1-4H2,11H3
38 atoms
N  -0.037163 3.273571 1.517934
H  0.269869 3.689168 2.385331
C  -0.280084 4.176109 0.40489
H  0.356773 3.926301 -0.446468
C  0.004753 5.626252 0.744544
O  -0.14328 6.510685 -0.044997
C  -0.137116 1.947273 1.512361
C  -0.720871 1.246215 0.275155
O  0.198221 1.263188 2.489718
N  0.038195 0.030792 0.032549
H  -0.659027 1.892451 -0.599455
C  -2.178753 0.856122 0.545024
H  -0.426509 -0.852332 0.156912
H  -2.542532 0.222391 -0.263809
H  -2.225522 0.280952 1.471847
O  0.433922 5.802985 2.009842
H  0.575463 6.750228 2.143132
H  -1.322155 4.133135 0.086603
S  -3.300556 2.253759 0.763858
H  -3.500857 2.502879 -0.535712
C  1.382599 0.059847 -0.004235
O  1.999737 1.123527 -0.020765
C  2.100861 -1.274456 0.03914
H  1.423866 -2.06711 0.365474
H  2.4179 -1.518025 -0.977577
C  3.33646 -1.227462 0.942522
H  4.082021 -0.546631 0.524757
H  3.785582 -2.219643 0.965019
C  3.042684 -0.818313 2.391812
H  2.15004 -1.329337 2.759763
N  2.821297 0.654982 2.538064
H  3.02649 1.129084 1.651077
H  1.820205 0.892574 2.730819
C  4.19232 -1.160128 3.338506
O  4.748085 -0.327273 4.005651
O  4.468888 -2.456517 3.334736
H  5.189465 -2.628489 3.958286
H  3.442103 0.989912 3.284068
totalener: -1406.24979297 hartree
nucrepener: 1823.11241064 hartree
electener: -3229.36220361 hartree
oneelecener: -5529.96963358 hartree
twoeener: 2300.60742997 hartree
kineticenergy: 1400.66089007 hartree
exchangeener: -105.329416736368 hartree
correlationener: -7.054601191807 hartree
xcener: -112.384017928174 hartree
temp: 298.15 k
press: 1.00 atm
thermalcorrenthalpy: 0.00094421 hartree
totalenthalpy: -1405.99999714 hartree
totalentropycorr: -0.06585719 hartree
gibbsenthalpy: -1406.06585433 hartree
gibbsminuselec: 0.26320980 hartree
chargesum: 1.0000000
charge: -0.101470 0.184712 -0.082167 0.146892 0.273359 -0.271800 0.225385 0.060352 -0.449522 -0.158900 0.122928 -0.199687 0.173473 0.142555 0.143600 -0.288249 0.242516 0.125843 -0.120811 0.112443 0.215065 -0.415488 -0.159664 0.102002 0.134653 -0.213383 0.129418 0.135126 0.017914 0.141712 -0.067506 0.222387 0.237563 0.305643 -0.297033 -0.245577 0.256017 0.219698
charge: 0.357382 -0.012058 -0.036518 0.037883 -0.430721 0.147562 -0.369950 -0.128286 0.074463 0.350886 0.032349 -0.242288 -0.015860 0.009979 0.017448 0.352537 -0.076487 0.021420 0.525002 -0.144742 -0.374874 0.078928 -0.000825 0.029828 0.047045 0.002601 0.036957 0.040777 -0.044089 0.047081 0.608018 0.016973 -0.031567 -0.428755 0.142220 0.401259 -0.062830 0.021252
qa: -0.1015 0.1847 -0.0822 0.1469 0.2734 -0.2718 0.2254 0.0604 -0.4495 -0.1589 0.1229 -0.1997 0.1735 0.1426 0.1436 -0.2882 0.2425 0.1258 -0.1208 0.1124 0.2151 -0.4155 -0.1597 0.1020 0.1347 -0.2134 0.1294 0.1351 0.0179 0.1417 -0.0675 0.2224 0.2376 0.3056 -0.2970 -0.2456 0.2560 0.2197
va: 3.1606 1.0376 3.7805 0.9989 4.3620 2.2388 4.2336 3.8137 2.0624 3.2513 1.0105 3.9432 1.0207 0.9933 1.0054 2.1655 1.0161 1.0416 2.1799 1.0190 4.2493 2.0891 3.8512 1.0161 1.0068 3.8770 1.0099 1.0234 3.8479 1.0138 3.5768 1.0220 1.0642 4.3258 2.1946 2.2671 1.0040 1.0171
dispcorr: -0.079909688 hartree
energy: -1406.334618747413
dipole: 2.29655 -0.86889 1.42765 -10.15617 7.51697 -2.63920 -4.06669 4.44505 0.37835
magnitude: 3.02435 au
magnitude: 7.68730 debye
zeropoint: 0.31066078 hartree
thermalvibcorrection: 0.01853863 hartree
thermalrotcorrection: 0.00141627 hartree
thermaltrasncorrection: 0.00141627 hartree
thermaltotal: -1406.00258680 hartree
thermalcorr: 0.02137117 hartree
nonthermalcorr: 0.31066078 hartree
totalcorr: 0.33203195 hartree
totalenthalpy: -1406.00164259 hartree
