program: Orca
programVersion: 5.0.2
elementType: N H C H C O C C O N H C H H H O H H S H C O C H H C H H C H N H H C O O H H
charge: 1
multiplicity: 1
keywords: wB97X-D3BJ Opt Freq def2-TZVPP def2/J RIJCOSX VeryTightSCF
keywords: PAL8 defgrid3 TightOpt
frequency: 0.00 0.00 0.00 0.00 0.00 0.00 28.77 44.01 57.03 68.80 73.23 89.80 104.41 107.75 121.29 131.84 139.77 176.04 181.22 217.01 226.29 237.04 267.54 278.77 287.29 299.36 329.04 339.76 360.64 374.27 440.50 452.42 473.50 506.29 520.71 540.07 565.23 587.00 592.06 608.07 630.39 650.35 666.61 726.98 737.24 745.46 751.12 766.07 810.96 825.03 846.67 897.48 907.13 939.92 946.38 972.80 996.33 1032.83 1059.80 1077.49 1098.34 1116.12 1149.42 1160.95 1177.90 1207.55 1211.51 1235.63 1243.89 1258.71 1272.81 1297.53 1310.39 1322.82 1358.67 1370.71 1372.92 1378.81 1399.72 1405.53 1410.91 1424.46 1472.73 1473.89 1482.01 1483.66 1489.34 1500.20 1561.22 1580.89 1651.51 1672.81 1788.64 1801.76 1841.89 1844.17 2772.89 2953.02 3089.59 3089.86 3099.48 3101.44 3107.83 3115.86 3144.81 3153.03 3157.47 3189.18 3482.91 3547.88 3629.42 3679.09 3703.35 3779.72
frequency: 28.77 44.01 57.03 68.80 73.23 89.80 104.41 107.75 121.29 131.84 139.77 176.04 181.22 217.01 226.29 237.04 267.54 278.77 287.29 299.36 329.04 339.76 360.64 374.27 440.50 452.42 473.50 506.29 520.71 540.07 565.23 587.00 592.06 608.07 630.39 650.35 666.61 726.98 737.24 745.46 751.12 766.07 810.96 825.03 846.67 897.48 907.13 939.92 946.38 972.80 996.33 1032.83 1059.80 1077.49 1098.34 1116.12 1149.42 1160.95 1177.90 1207.55 1211.51 1235.63 1243.89 1258.71 1272.81 1297.53 1310.39 1322.82 1358.67 1370.71 1372.92 1378.81 1399.72 1405.53 1410.91 1424.46 1472.73 1473.89 1482.01 1483.66 1489.34 1500.20 1561.22 1580.89 1651.51 1672.81 1788.64 1801.76 1841.89 1844.17 2772.89 2953.02 3089.59 3089.86 3099.48 3101.44 3107.83 3115.86 3144.81 3153.03 3157.47 3189.18 3482.91 3547.88 3629.42 3679.09 3703.35 3779.72
formula: C10H18N3O6S
InChI: InChI=1S/C10H18N3O6S/c11-5(10(18)19)1-2-7(14)13-6(4-20)9(17)12-3-8(15)16/h5-6,12-13,15,18,20H,1-4H2,11H3
38 atoms
N  -0.436984 1.889174 -2.214815
H  -0.457841 2.688233 -2.831071
C  -0.981094 0.647828 -2.716436
H  -1.81393 0.264575 -2.127297
C  0.076433 -0.441747 -2.796831
O  -0.192108 -1.627256 -2.722293
C  -0.42851 2.279472 -0.876183
C  -0.747407 1.205089 0.178207
O  -0.214187 3.426595 -0.586622
N  0.023135 -0.021036 -0.017021
H  -1.7956 0.928648 0.032657
C  -0.611147 1.778024 1.5896
H  -0.498719 -0.859405 -0.189302
H  -0.603552 0.947426 2.296888
H  0.323745 2.321926 1.692408
O  1.320918 -0.039742 -2.959958
H  1.359064 0.926006 -2.843974
H  -1.358727 0.801228 -3.730352
S  -2.007994 2.816241 2.067433
H  -1.643448 3.893563 1.36564
C  1.387734 -0.03121 0.01934
O  2.01836 0.997391 0.139754
C  2.113002 -1.361483 -0.183534
H  2.050041 -1.612733 -1.24531
H  3.158534 -1.110173 -0.011311
C  1.793448 -2.573369 0.703915
H  1.694286 -2.276354 1.748909
H  2.664476 -3.231209 0.662626
C  0.570457 -3.445984 0.372156
H  0.711194 -4.418041 0.849942
N  0.424925 -3.701925 -1.099373
H  0.280826 -2.833631 -1.675882
H  1.245823 -4.184687 -1.462792
C  -0.767855 -2.917111 0.866285
O  -1.684761 -2.663506 0.126773
O  -0.777357 -2.795868 2.18407
H  -1.647362 -2.484564 2.475164
H  -0.397957 -4.279153 -1.278511
totalener: -1406.21002538 hartree
nucrepener: 1947.03054697 hartree
electener: -3353.24057235 hartree
oneelecener: -5777.15382644 hartree
twoeener: 2423.91325408 hartree
kineticenergy: 1400.63234159 hartree
exchangeener: -105.314198520335 hartree
correlationener: -7.057606283654 hartree
xcener: -112.371804803989 hartree
temp: 298.15 k
press: 1.00 atm
thermalcorrenthalpy: 0.00094421 hartree
totalenthalpy: -1405.96612549 hartree
totalentropycorr: -0.06483761 hartree
gibbsenthalpy: -1406.03096310 hartree
gibbsminuselec: 0.26372333 hartree
chargesum: 1.0000000
charge: -0.280029 0.208851 -0.082073 0.129011 0.324256 -0.383195 0.224711 0.029545 -0.288679 -0.248780 0.114019 -0.147316 0.176921 0.088201 0.155322 -0.209433 0.255174 0.153981 -0.167313 0.135438 0.198015 -0.300629 -0.212220 0.098838 0.160309 -0.215137 0.140697 0.150686 -0.005466 0.176672 -0.062080 0.226005 0.229406 0.246775 -0.287557 -0.228994 0.259399 0.236667
charge: 0.303458 -0.015258 -0.053251 0.035206 -0.424952 0.128125 -0.363092 -0.144270 0.146943 0.328608 0.032979 -0.242534 -0.054681 0.003406 0.015149 0.419528 -0.085939 0.047996 0.480965 -0.140900 -0.400191 0.126988 -0.008273 0.019237 0.052409 0.000478 0.046985 0.039224 -0.057649 0.052486 0.611456 -0.033566 0.052738 -0.460485 0.131292 0.412444 -0.060258 0.057201
qa: -0.2800 0.2089 -0.0821 0.1290 0.3243 -0.3832 0.2247 0.0295 -0.2887 -0.2488 0.1140 -0.1473 0.1769 0.0882 0.1553 -0.2094 0.2552 0.1540 -0.1673 0.1354 0.1980 -0.3006 -0.2122 0.0988 0.1603 -0.2151 0.1407 0.1507 -0.0055 0.1767 -0.0621 0.2260 0.2294 0.2468 -0.2876 -0.2290 0.2594 0.2367
va: 3.0268 1.0037 3.8315 1.0189 4.2093 2.1244 4.2609 3.7211 2.2173 2.9902 1.0328 3.9803 1.0462 1.0147 1.0146 2.2667 1.0165 0.9987 2.1547 1.0245 4.2878 2.2200 3.7426 1.0321 1.0202 3.8477 1.0168 0.9918 3.7732 0.9945 3.6394 1.1004 0.9739 4.4266 2.1867 2.2906 1.0010 0.9773
dispcorr: -0.085187864 hartree
energy: -1406.300911527437
dipole: 4.48192 -4.15839 0.32353 -10.91090 5.62810 -5.28281 -1.51027 0.16415 -1.34613
magnitude: 5.46121 au
magnitude: 13.88129 debye
zeropoint: 0.31083477 hartree
thermalvibcorrection: 0.01819378 hartree
thermalrotcorrection: 0.00141627 hartree
thermaltrasncorrection: 0.00141627 hartree
thermaltotal: -1405.96905044 hartree
thermalcorr: 0.02102632 hartree
nonthermalcorr: 0.31083477 hartree
totalcorr: 0.33186109 hartree
totalenthalpy: -1405.96810623 hartree
