program: Orca
programVersion: 5.0.2
elementType: N H C H C O C C O N H C H H H O H H S H C O C H H C H H C H N H H C O O H H
charge: 1
multiplicity: 1
keywords: wB97X-D3BJ Opt Freq def2-TZVPP def2/J RIJCOSX VeryTightSCF
keywords: PAL8 defgrid3 TightOpt
frequency: 0.00 0.00 0.00 0.00 0.00 0.00 15.60 22.36 31.88 36.85 41.11 44.33 49.58 59.60 77.42 114.73 129.36 134.44 150.88 161.48 176.63 195.89 225.45 237.48 260.56 283.89 299.89 310.45 339.57 389.02 403.42 412.67 450.64 457.17 521.28 554.35 586.10 586.55 596.19 622.31 623.96 648.55 683.95 718.75 723.35 738.83 760.37 789.98 807.21 827.07 842.12 893.58 910.43 939.22 952.82 973.37 982.27 1026.14 1033.44 1085.27 1091.84 1096.08 1133.25 1167.30 1183.98 1205.58 1208.56 1212.68 1230.23 1276.02 1280.65 1287.77 1309.60 1313.16 1335.82 1343.03 1365.63 1379.27 1382.60 1399.54 1411.29 1431.55 1446.19 1469.01 1497.99 1500.24 1511.47 1527.93 1528.40 1575.77 1651.31 1660.71 1758.69 1799.30 1891.37 1902.90 2765.31 3054.09 3062.00 3097.13 3099.57 3104.70 3111.47 3137.04 3140.33 3162.61 3203.01 3440.54 3519.39 3536.79 3585.01 3672.51 3780.86 3854.62
frequency: 15.60 22.36 31.88 36.85 41.11 44.33 49.58 59.60 77.42 114.73 129.36 134.44 150.88 161.48 176.63 195.89 225.45 237.48 260.56 283.89 299.89 310.45 339.57 389.02 403.42 412.67 450.64 457.17 521.28 554.35 586.10 586.55 596.19 622.31 623.96 648.55 683.95 718.75 723.35 738.83 760.37 789.98 807.21 827.07 842.12 893.58 910.43 939.22 952.82 973.37 982.27 1026.14 1033.44 1085.27 1091.84 1096.08 1133.25 1167.30 1183.98 1205.58 1208.56 1212.68 1230.23 1276.02 1280.65 1287.77 1309.60 1313.16 1335.82 1343.03 1365.63 1379.27 1382.60 1399.54 1411.29 1431.55 1446.19 1469.01 1497.99 1500.24 1511.47 1527.93 1528.40 1575.77 1651.31 1660.71 1758.69 1799.30 1891.37 1902.90 2765.31 3054.09 3062.00 3097.13 3099.57 3104.70 3111.47 3137.04 3140.33 3162.61 3203.01 3440.54 3519.39 3536.79 3585.01 3672.51 3780.86 3854.62
formula: C10H18N3O6S
InChI: InChI=1S/C10H18N3O6S/c11-5(10(18)19)1-2-7(14)13-6(4-20)9(17)12-3-8(15)16/h5-6,12-13,15,18,20H,1-4H2,11H3
38 atoms
N  -1.507708 1.500201 -3.038727
H  -1.404864 1.332049 -4.031909
C  -2.7323 2.170493 -2.678408
H  -3.239675 1.675855 -1.845554
C  -3.661298 2.156881 -3.89175
O  -3.344203 1.689464 -4.945462
C  -0.634474 0.843487 -2.243864
C  -0.810438 0.976035 -0.713503
O  0.266136 0.165712 -2.715788
N  0.008267 -0.037655 -0.074169
H  -1.844689 0.737339 -0.454072
C  -0.529025 2.40698 -0.235252
H  -0.388719 -0.960954 -0.099749
H  0.458874 2.729425 -0.547235
H  -1.260094 3.080131 -0.679812
O  -4.861747 2.723065 -3.707704
H  -4.968168 3.063693 -2.813689
H  -2.569364 3.217361 -2.399127
S  -0.710618 2.614156 1.545906
H  0.448042 2.035863 1.878482
C  1.3686 0.007844 -0.109352
O  2.02172 1.031052 -0.167066
C  2.080141 -1.342062 -0.118066
H  2.772923 -1.376586 0.724995
H  1.393197 -2.183143 -0.034864
C  2.845778 -1.370617 -1.443291
H  3.49643 -0.49073 -1.456905
H  2.137892 -1.262686 -2.271552
C  3.704142 -2.616024 -1.647035
H  4.387397 -2.777073 -0.812324
N  4.553628 -2.385793 -2.880515
H  3.94886 -2.256436 -3.695073
H  5.119475 -1.543863 -2.763409
C  2.863588 -3.872521 -1.834154
O  2.280736 -4.400756 -0.940027
O  2.847364 -4.268386 -3.122057
H  2.271256 -5.042226 -3.207888
H  5.168534 -3.175129 -3.082519
totalener: -1406.19967129 hartree
nucrepener: 1754.88181144 hartree
electener: -3161.08148273 hartree
oneelecener: -5395.65514524 hartree
twoeener: 2234.57366251 hartree
kineticenergy: 1400.60743946 hartree
exchangeener: -105.307960681133 hartree
correlationener: -7.044947533950 hartree
xcener: -112.352908215083 hartree
temp: 298.15 k
press: 1.00 atm
thermalcorrenthalpy: 0.00094421 hartree
totalenthalpy: -1405.94550501 hartree
totalentropycorr: -0.06790185 hartree
gibbsenthalpy: -1406.01340686 hartree
gibbsminuselec: 0.26199614 hartree
chargesum: 1.0000000
charge: -0.173081 0.192297 -0.153082 0.118015 0.314656 -0.284708 0.203581 0.087233 -0.405841 -0.194593 0.119455 -0.176855 0.156852 0.149125 0.113614 -0.213638 0.216604 0.130979 -0.153117 0.115513 0.249272 -0.378108 -0.191154 0.114919 0.103045 -0.209039 0.123661 0.136676 0.008199 0.169686 -0.041257 0.246273 0.243629 0.282684 -0.233790 -0.297415 0.262050 0.247662
charge: 0.333402 -0.010235 -0.064013 0.026206 -0.431792 0.148816 -0.369923 -0.141068 0.059053 0.327861 0.029622 -0.244658 -0.022284 0.004795 0.002673 0.392552 -0.097002 0.024101 0.484253 -0.145124 -0.384092 0.099544 0.005986 0.036069 0.023464 -0.010165 0.036581 0.036187 -0.040008 0.050782 0.615834 0.063671 0.061297 -0.435968 0.181860 0.354948 -0.062973 0.059746
qa: -0.1731 0.1923 -0.1531 0.1180 0.3147 -0.2847 0.2036 0.0872 -0.4058 -0.1946 0.1195 -0.1769 0.1569 0.1491 0.1136 -0.2136 0.2166 0.1310 -0.1531 0.1155 0.2493 -0.3781 -0.1912 0.1149 0.1030 -0.2090 0.1237 0.1367 0.0082 0.1697 -0.0413 0.2463 0.2436 0.2827 -0.2338 -0.2974 0.2620 0.2477
va: 3.1220 1.0404 3.8981 0.9885 4.3507 2.2148 4.3190 3.7499 2.0934 3.2281 1.0110 3.9589 1.0274 1.0179 1.0012 2.2608 1.0243 0.9783 2.1612 1.0280 4.2790 2.1321 3.9524 1.0222 1.0361 3.8668 1.0373 1.0303 3.7264 0.9961 3.6701 0.9775 0.9679 4.3444 2.2699 2.1890 1.0028 0.9690
dispcorr: -0.076661374 hartree
energy: -1406.280709652924
dipole: 10.71002 -5.78524 4.92478 -3.73174 -0.08797 -3.81971 0.81302 -2.07803 -1.26501
magnitude: 6.35955 au
magnitude: 16.16470 debye
zeropoint: 0.30990715 hartree
thermalvibcorrection: 0.01959293 hartree
thermalrotcorrection: 0.00141627 hartree
thermaltrasncorrection: 0.00141627 hartree
thermaltotal: -1405.94837703 hartree
thermalcorr: 0.02242548 hartree
nonthermalcorr: 0.30990715 hartree
totalcorr: 0.33233262 hartree
totalenthalpy: -1405.94743282 hartree
