program: Orca
programVersion: 5.0.2
elementType: N H C H C O C C O N H C H H H O H H S H C O C H H C H H C H N H H C O O H H
charge: 1
multiplicity: 1
keywords: wB97X-D3BJ Opt Freq def2-TZVPP def2/J RIJCOSX VeryTightSCF
keywords: PAL8 defgrid3 TightOpt
frequency: 0.00 0.00 0.00 0.00 0.00 0.00 20.38 26.14 43.54 57.22 69.90 79.29 95.35 98.09 110.27 118.58 175.44 185.73 193.13 209.98 225.35 249.46 262.56 298.13 300.34 311.64 317.02 351.34 369.87 406.88 439.99 455.49 468.97 514.07 520.09 559.54 583.81 598.58 634.66 657.04 663.23 670.57 683.60 703.80 721.50 731.01 739.46 805.70 826.75 861.61 864.66 886.75 893.96 937.63 972.69 999.58 1024.77 1041.10 1055.10 1069.94 1111.79 1142.16 1159.54 1166.20 1174.71 1202.57 1210.72 1233.11 1253.88 1262.75 1270.12 1291.84 1309.56 1316.41 1329.73 1344.47 1361.17 1378.27 1417.91 1429.20 1445.96 1452.28 1467.83 1477.48 1479.58 1487.65 1493.70 1526.00 1532.12 1568.98 1633.53 1678.13 1732.07 1742.74 1836.81 1851.68 2757.98 3087.13 3097.25 3107.11 3115.83 3116.11 3135.15 3150.88 3160.65 3161.10 3194.42 3259.25 3350.71 3410.86 3591.66 3601.77 3787.96 3800.61
frequency: 20.38 26.14 43.54 57.22 69.90 79.29 95.35 98.09 110.27 118.58 175.44 185.73 193.13 209.98 225.35 249.46 262.56 298.13 300.34 311.64 317.02 351.34 369.87 406.88 439.99 455.49 468.97 514.07 520.09 559.54 583.81 598.58 634.66 657.04 663.23 670.57 683.60 703.80 721.50 731.01 739.46 805.70 826.75 861.61 864.66 886.75 893.96 937.63 972.69 999.58 1024.77 1041.10 1055.10 1069.94 1111.79 1142.16 1159.54 1166.20 1174.71 1202.57 1210.72 1233.11 1253.88 1262.75 1270.12 1291.84 1309.56 1316.41 1329.73 1344.47 1361.17 1378.27 1417.91 1429.20 1445.96 1452.28 1467.83 1477.48 1479.58 1487.65 1493.70 1526.00 1532.12 1568.98 1633.53 1678.13 1732.07 1742.74 1836.81 1851.68 2757.98 3087.13 3097.25 3107.11 3115.83 3116.11 3135.15 3150.88 3160.65 3161.10 3194.42 3259.25 3350.71 3410.86 3591.66 3601.77 3787.96 3800.61
formula: C10H18N3O6S
InChI: InChI=1S/C10H18N3O6S/c11-5(10(18)19)1-2-7(14)13-6(4-20)9(17)12-3-8(15)16/h5-6,12-13,15,18,20H,1-4H2,11H3
38 atoms
N  0.146126 3.132518 1.747266
H  0.447392 3.388548 2.678285
C  0.660695 3.999406 0.709499
H  0.316359 3.704101 -0.277728
C  2.183949 3.995517 0.717473
O  2.85826 3.413075 1.530758
C  -0.020101 1.793729 1.635475
C  -0.588727 1.213099 0.334616
O  0.195967 1.050022 2.591319
N  0.071003 -0.043788 0.060974
H  -0.410218 1.89467 -0.494109
C  -2.108559 1.018178 0.464817
H  -0.427487 -0.874517 0.349359
H  -2.561777 1.93729 0.834434
H  -2.51946 0.826897 -0.527036
O  2.669213 4.740832 -0.269791
H  3.63512 4.735663 -0.222256
H  0.317704 5.023074 0.870523
S  -2.630197 -0.395463 1.462315
H  -2.105424 0.012232 2.623812
C  1.413574 -0.051012 0.002716
O  2.049203 1.001906 -0.076329
C  2.115941 -1.387635 0.105995
H  1.445536 -2.141376 0.524813
H  2.374212 -1.712252 -0.904816
C  3.399643 -1.286989 0.935173
H  4.110976 -0.617538 0.446506
H  3.860359 -2.273309 0.976575
C  3.18487 -0.821577 2.382378
H  2.317466 -1.325114 2.814931
N  2.963357 0.654585 2.497686
H  3.664918 1.034968 3.143595
H  3.041667 1.125451 1.586484
C  4.388044 -1.12977 3.27204
O  4.993279 -0.273965 3.862438
O  4.653541 -2.428645 3.313071
H  5.411826 -2.577381 3.896331
H  2.00938 0.874516 2.826793
totalener: -1406.25692483 hartree
nucrepener: 1908.35477004 hartree
electener: -3314.61169488 hartree
oneelecener: -5700.38725245 hartree
twoeener: 2385.77555758 hartree
kineticenergy: 1400.69653265 hartree
exchangeener: -105.334461801869 hartree
correlationener: -7.058791715225 hartree
xcener: -112.393253517094 hartree
temp: 298.15 k
press: 1.00 atm
thermalcorrenthalpy: 0.00094421 hartree
totalenthalpy: -1406.01003801 hartree
totalentropycorr: -0.06481271 hartree
gibbsenthalpy: -1406.07485072 hartree
gibbsminuselec: 0.26496734 hartree
chargesum: 1.0000000
charge: -0.145808 0.184148 -0.068595 0.120886 0.333711 -0.378289 0.159784 0.072715 -0.416752 -0.152808 0.129440 -0.168189 0.166440 0.126506 0.149251 -0.242992 0.244746 0.158985 -0.135074 0.123319 0.231473 -0.436036 -0.160092 0.106621 0.132108 -0.208710 0.128957 0.135487 0.018466 0.143477 -0.054452 0.223849 0.231292 0.302651 -0.296454 -0.246169 0.254501 0.231610
charge: 0.336734 -0.002484 -0.038950 0.034826 -0.435624 0.088931 -0.368355 -0.132608 0.078143 0.345290 0.032047 -0.227864 -0.039186 0.013973 0.019500 0.394881 -0.074124 0.042858 0.509289 -0.145116 -0.371013 0.078143 0.001184 0.032401 0.046710 0.003084 0.036314 0.040114 -0.042682 0.047189 0.609923 0.027574 0.010028 -0.428664 0.141766 0.399930 -0.064122 -0.000036
qa: -0.1458 0.1841 -0.0686 0.1209 0.3337 -0.3783 0.1598 0.0727 -0.4168 -0.1528 0.1294 -0.1682 0.1664 0.1265 0.1493 -0.2430 0.2447 0.1590 -0.1351 0.1233 0.2315 -0.4360 -0.1601 0.1066 0.1321 -0.2087 0.1290 0.1355 0.0185 0.1435 -0.0545 0.2238 0.2313 0.3027 -0.2965 -0.2462 0.2545 0.2316
va: 3.1881 1.0211 3.8358 1.0195 4.2923 2.1052 4.2937 3.8582 2.0726 3.2268 1.0087 3.9510 1.0700 1.0089 0.9927 2.2629 1.0135 0.9977 2.1969 1.0257 4.2119 2.0660 3.8680 1.0165 1.0072 3.8615 1.0126 1.0238 3.8354 1.0143 3.6062 1.0168 1.0286 4.3290 2.1944 2.2656 1.0052 1.0436
dispcorr: -0.082779834 hartree
energy: -1406.345966281781
dipole: -0.45582 1.40773 0.95192 -1.99393 1.72680 -0.26714 -3.70592 3.55727 -0.14865
magnitude: 0.99980 au
magnitude: 2.54130 debye
zeropoint: 0.31169953 hartree
thermalvibcorrection: 0.01808896 hartree
thermalrotcorrection: 0.00141627 hartree
thermaltrasncorrection: 0.00141627 hartree
thermaltotal: -1406.01334525 hartree
thermalcorr: 0.02092150 hartree
nonthermalcorr: 0.31169953 hartree
totalcorr: 0.33262103 hartree
totalenthalpy: -1406.01240104 hartree
