program: Orca
programVersion: 5.0.2
elementType: N H C H C O C C O N H C H H H O H H S H C O C H H C H H C H N H H C O O H H
charge: 1
multiplicity: 1
keywords: wB97X-D3BJ Opt Freq def2-TZVPP def2/J RIJCOSX VeryTightSCF
keywords: PAL8 defgrid3 TightOpt
frequency: 0.00 0.00 0.00 0.00 0.00 0.00 25.00 33.46 45.58 62.18 67.73 69.17 86.81 99.93 109.10 149.48 154.64 175.24 201.90 207.91 221.16 237.88 250.41 275.92 307.03 325.21 330.61 355.34 385.99 417.11 434.98 464.49 491.99 521.97 534.15 540.49 550.89 574.74 595.69 614.45 638.39 664.06 671.99 717.70 769.00 771.68 781.22 798.27 808.71 816.10 861.79 892.66 901.08 929.38 956.20 983.56 998.05 1015.78 1051.27 1082.59 1107.02 1142.90 1159.24 1164.97 1180.18 1207.79 1239.67 1251.71 1265.50 1277.28 1278.86 1301.62 1337.36 1360.45 1364.18 1376.50 1379.55 1395.77 1401.65 1422.61 1424.40 1449.39 1465.42 1491.15 1496.37 1508.83 1510.37 1513.08 1533.94 1583.59 1612.59 1705.02 1713.98 1734.38 1842.78 1865.09 2762.87 2819.20 3087.91 3098.45 3114.99 3116.28 3120.29 3122.06 3143.26 3162.60 3187.95 3237.19 3418.04 3454.98 3570.25 3625.01 3689.76 3814.90
frequency: 25.00 33.46 45.58 62.18 67.73 69.17 86.81 99.93 109.10 149.48 154.64 175.24 201.90 207.91 221.16 237.88 250.41 275.92 307.03 325.21 330.61 355.34 385.99 417.11 434.98 464.49 491.99 521.97 534.15 540.49 550.89 574.74 595.69 614.45 638.39 664.06 671.99 717.70 769.00 771.68 781.22 798.27 808.71 816.10 861.79 892.66 901.08 929.38 956.20 983.56 998.05 1015.78 1051.27 1082.59 1107.02 1142.90 1159.24 1164.97 1180.18 1207.79 1239.67 1251.71 1265.50 1277.28 1278.86 1301.62 1337.36 1360.45 1364.18 1376.50 1379.55 1395.77 1401.65 1422.61 1424.40 1449.39 1465.42 1491.15 1496.37 1508.83 1510.37 1513.08 1533.94 1583.59 1612.59 1705.02 1713.98 1734.38 1842.78 1865.09 2762.87 2819.20 3087.91 3098.45 3114.99 3116.28 3120.29 3122.06 3143.26 3162.60 3187.95 3237.19 3418.04 3454.98 3570.25 3625.01 3689.76 3814.90
formula: C10H18N3O6S
InChI: InChI=1S/C10H18N3O6S/c11-5(10(18)19)1-2-7(14)13-6(4-20)9(17)12-3-8(15)16/h5-6,12-13,15,18,20H,1-4H2,11H3
38 atoms
N  -0.047898 3.458577 -0.562893
H  0.236666 3.974445 -1.383076
C  0.227217 4.090945 0.712789
H  0.190345 5.169096 0.550002
C  1.598484 3.764418 1.287987
O  1.78555 3.285863 2.372255
C  -0.418766 2.205039 -0.883603
C  -0.91638 1.148758 0.133682
O  -0.451041 1.87145 -2.065296
N  -0.13373 -0.071855 -0.058357
H  -1.910096 0.910754 -0.250262
C  -1.073512 1.475758 1.620359
H  -0.639618 -0.93019 -0.18906
H  -0.133259 1.7440 2.09585
H  -1.770107 2.305663 1.734109
O  2.585845 4.126258 0.451036
H  3.421016 3.978611 0.912919
H  -0.518738 3.851874 1.458976
S  -1.836152 0.101405 2.522868
H  -0.7052 -0.539069 2.835367
C  1.193798 -0.105457 -0.003023
O  1.864269 0.923699 0.184461
C  1.896152 -1.436768 -0.172503
H  2.546488 -1.533166 0.700542
H  1.190989 -2.266745 -0.128732
C  2.727119 -1.57495 -1.469078
H  2.088664 -1.933191 -2.275055
H  3.481193 -2.347616 -1.304486
C  3.409551 -0.322066 -2.014355
H  4.112511 -0.608231 -2.799449
N  4.173047 0.429614 -0.965365
H  3.445478 0.697671 -0.241263
H  4.943079 -0.102128 -0.568931
C  2.468711 0.745303 -2.597695
O  2.801834 1.902637 -2.609566
O  1.333038 0.238394 -3.020078
H  0.64271 0.944067 -3.036395
H  4.507638 1.301203 -1.384043
totalener: -1406.22599079 hartree
nucrepener: 1967.49812837 hartree
electener: -3373.72411916 hartree
oneelecener: -5818.96746431 hartree
twoeener: 2445.24334516 hartree
kineticenergy: 1400.64264829 hartree
exchangeener: -105.326309467112 hartree
correlationener: -7.059466681927 hartree
xcener: -112.385776149038 hartree
temp: 298.15 k
press: 1.00 atm
thermalcorrenthalpy: 0.00094421 hartree
totalenthalpy: -1405.98108154 hartree
totalentropycorr: -0.06448289 hartree
gibbsenthalpy: -1406.04556443 hartree
gibbsminuselec: 0.26442534 hartree
chargesum: 1.0000000
charge: -0.144831 0.201574 -0.106484 0.155210 0.297746 -0.293667 0.246632 0.019888 -0.419335 -0.138967 0.144523 -0.180855 0.199944 0.148021 0.132008 -0.265675 0.223709 0.135996 -0.138532 0.096714 0.307521 -0.458808 -0.228043 0.138382 0.110985 -0.190520 0.134595 0.135210 -0.021608 0.165472 -0.079428 0.228426 0.219099 0.300931 -0.307637 -0.268390 0.268834 0.231360
charge: 0.348048 0.003475 -0.037594 0.043599 -0.447120 0.126866 -0.353128 -0.125163 0.104732 0.370287 0.050279 -0.246578 -0.007621 0.008044 0.011532 0.363803 -0.091746 0.027950 0.500400 -0.154421 -0.360996 0.125328 0.002891 0.038321 0.036777 0.001484 0.043276 0.033097 -0.050498 0.046197 0.602511 -0.029992 0.035324 -0.464515 0.129192 0.397092 -0.122101 0.040968
qa: -0.1448 0.2016 -0.1065 0.1552 0.2977 -0.2937 0.2466 0.0199 -0.4193 -0.1390 0.1445 -0.1809 0.1999 0.1480 0.1320 -0.2657 0.2237 0.1360 -0.1385 0.0967 0.3075 -0.4588 -0.2280 0.1384 0.1110 -0.1905 0.1346 0.1352 -0.0216 0.1655 -0.0794 0.2284 0.2191 0.3009 -0.3076 -0.2684 0.2688 0.2314
va: 3.1775 1.0120 3.8535 0.9952 4.2560 2.1934 4.2461 3.7649 2.0905 3.2570 1.0144 3.8736 1.0066 1.0278 1.0046 2.2000 1.0312 1.0049 2.1566 1.0259 4.0843 2.0491 3.8619 1.0085 1.0209 3.8444 1.0194 1.0010 3.8366 0.9912 3.6090 1.0771 0.9803 4.3886 2.1951 2.2503 1.0465 1.0003
dispcorr: -0.084336066 hartree
energy: -1406.316701070368
dipole: 6.49255 -3.57045 2.92211 -7.48786 5.69254 -1.79532 0.09542 -0.65320 -0.55778
magnitude: 3.47462 au
magnitude: 8.83179 debye
zeropoint: 0.31128717 hartree
thermalvibcorrection: 0.01811003 hartree
thermalrotcorrection: 0.00141627 hartree
thermaltrasncorrection: 0.00141627 hartree
thermaltotal: -1405.98447133 hartree
thermalcorr: 0.02094257 hartree
nonthermalcorr: 0.31128717 hartree
totalcorr: 0.33222974 hartree
totalenthalpy: -1405.98352713 hartree
