program: Orca
programVersion: 5.0.2
elementType: N H C H C O C C O N H C H H H O H H S H C O C H H C H H C H N H H C O O H H
charge: 1
multiplicity: 1
keywords: wB97X-D3BJ Opt Freq def2-TZVPP def2/J RIJCOSX VeryTightSCF
keywords: PAL8 defgrid3 TightOpt
frequency: 0.00 0.00 0.00 0.00 0.00 0.00 12.31 27.31 30.68 41.12 49.23 58.14 69.34 77.16 104.77 112.44 134.95 147.47 168.31 198.65 234.08 248.39 273.30 283.13 293.94 316.40 330.41 352.79 380.93 414.20 451.80 465.53 498.11 513.10 529.56 540.16 582.75 592.68 612.47 626.58 649.17 667.67 728.12 733.71 753.13 766.87 769.21 793.09 807.59 820.64 870.67 887.92 902.30 923.58 969.69 978.11 1012.07 1040.23 1066.58 1095.58 1123.14 1135.48 1156.31 1188.74 1195.71 1201.00 1212.21 1214.06 1253.32 1272.50 1292.95 1298.26 1330.71 1340.74 1347.10 1365.17 1375.20 1397.03 1403.20 1418.26 1440.65 1452.39 1460.70 1478.33 1485.94 1499.40 1508.96 1510.27 1518.49 1589.68 1634.67 1702.55 1725.03 1799.77 1824.52 1861.30 2377.66 2750.74 3079.36 3098.17 3099.49 3104.72 3109.54 3143.86 3148.10 3151.71 3160.84 3167.98 3476.43 3482.90 3577.61 3643.14 3786.00 3801.19
frequency: 12.31 27.31 30.68 41.12 49.23 58.14 69.34 77.16 104.77 112.44 134.95 147.47 168.31 198.65 234.08 248.39 273.30 283.13 293.94 316.40 330.41 352.79 380.93 414.20 451.80 465.53 498.11 513.10 529.56 540.16 582.75 592.68 612.47 626.58 649.17 667.67 728.12 733.71 753.13 766.87 769.21 793.09 807.59 820.64 870.67 887.92 902.30 923.58 969.69 978.11 1012.07 1040.23 1066.58 1095.58 1123.14 1135.48 1156.31 1188.74 1195.71 1201.00 1212.21 1214.06 1253.32 1272.50 1292.95 1298.26 1330.71 1340.74 1347.10 1365.17 1375.20 1397.03 1403.20 1418.26 1440.65 1452.39 1460.70 1478.33 1485.94 1499.40 1508.96 1510.27 1518.49 1589.68 1634.67 1702.55 1725.03 1799.77 1824.52 1861.30 2377.66 2750.74 3079.36 3098.17 3099.49 3104.72 3109.54 3143.86 3148.10 3151.71 3160.84 3167.98 3476.43 3482.90 3577.61 3643.14 3786.00 3801.19
formula: C10H18N3O6S
InChI: InChI=1S/C10H18N3O6S/c11-5(10(18)19)1-2-7(14)13-6(4-20)9(17)12-3-8(15)16/h5-6,12-13,15,18,20H,1-4H2,11H3
38 atoms
N  -2.706039 0.262783 1.551729
H  -3.032839 0.273876 2.505322
C  -3.600322 -0.329631 0.590877
H  -4.540082 -0.558356 1.093486
C  -3.105169 -1.617407 -0.04143
O  -1.962211 -2.013993 -0.05402
C  -1.64662 1.115202 1.392701
C  -0.863105 1.196662 0.067803
O  -1.212843 1.731728 2.341799
N  -0.01516 0.009848 -0.007869
H  -0.201505 2.04578 0.224292
C  -1.620646 1.412673 -1.239814
H  -0.491919 -0.885207 0.063601
H  -0.897056 1.663295 -2.016016
H  -2.134386 0.509502 -1.568157
O  -4.105306 -2.267686 -0.632068
H  -3.755555 -3.068509 -1.046097
H  -3.865733 0.362246 -0.211837
S  -2.885159 2.696333 -1.114425
H  -2.107988 3.633897 -0.558467
C  1.30678 0.059913 -0.064891
O  1.940897 1.130548 -0.153838
C  2.058954 -1.252592 0.013793
H  2.647322 -1.200305 0.934915
H  1.370086 -2.087874 0.138871
C  2.973248 -1.561733 -1.186425
H  2.375974 -1.921151 -2.023234
H  3.621251 -2.39037 -0.895256
C  3.854917 -0.430127 -1.730905
H  4.720573 -0.871967 -2.231247
N  4.348383 0.488184 -0.662787
H  3.426898 0.889588 -0.235288
H  4.932059 0.021053 0.024974
C  3.232227 0.506185 -2.770427
O  3.623638 1.631824 -2.912597
O  2.294386 -0.081146 -3.508742
H  2.012728 0.543252 -4.193026
H  4.857824 1.26192 -1.092877
totalener: -1406.23389096 hartree
nucrepener: 1856.30819470 hartree
electener: -3262.54208566 hartree
oneelecener: -5597.03641568 hartree
twoeener: 2334.49433002 hartree
kineticenergy: 1400.63768855 hartree
exchangeener: -105.320683306891 hartree
correlationener: -7.053264044764 hartree
xcener: -112.373947351654 hartree
temp: 298.15 k
press: 1.00 atm
thermalcorrenthalpy: 0.00094421 hartree
totalenthalpy: -1405.98531450 hartree
totalentropycorr: -0.06611740 hartree
gibbsenthalpy: -1406.05143190 hartree
gibbsminuselec: 0.26180316 hartree
chargesum: 1.0000000
charge: -0.189744 0.187159 -0.122317 0.155859 0.331939 -0.361419 0.184744 0.001396 -0.306717 -0.151204 0.151297 -0.147140 0.215866 0.124079 0.090289 -0.238394 0.241776 0.134392 -0.126247 0.116342 0.315754 -0.415426 -0.242642 0.132883 0.114467 -0.177881 0.127855 0.139920 -0.043344 0.152515 -0.075796 0.229443 0.212313 0.300196 -0.289418 -0.252388 0.249608 0.229984
charge: 0.320231 -0.008370 -0.058998 0.046698 -0.426938 0.116131 -0.387575 -0.123096 0.110892 0.376219 0.044520 -0.252769 -0.050061 0.006196 0.003158 0.392548 -0.076675 0.026083 0.508705 -0.138260 -0.340254 0.147980 -0.000377 0.037400 0.040586 0.002730 0.039034 0.035383 -0.055223 0.048364 0.591959 -0.069074 0.030261 -0.441262 0.142541 0.390537 -0.066923 0.037700
qa: -0.1897 0.1872 -0.1223 0.1559 0.3319 -0.3614 0.1847 0.0014 -0.3067 -0.1512 0.1513 -0.1471 0.2159 0.1241 0.0903 -0.2384 0.2418 0.1344 -0.1262 0.1163 0.3158 -0.4154 -0.2426 0.1329 0.1145 -0.1779 0.1279 0.1399 -0.0433 0.1525 -0.0758 0.2294 0.2123 0.3002 -0.2894 -0.2524 0.2496 0.2300
va: 3.0640 1.0184 3.8482 1.0058 4.2264 2.1128 4.3918 3.6992 2.2071 3.2640 1.0421 4.0400 1.0425 1.0050 1.0074 2.2620 1.0156 1.0215 2.1853 1.0221 4.0922 2.1076 3.9115 1.0044 1.0248 3.7847 1.0221 0.9977 3.9070 0.9979 3.5452 1.0997 0.9858 4.3601 2.2079 2.2432 1.0095 0.9964
dispcorr: -0.079715148 hartree
energy: -1406.318987143378
dipole: 9.60459 -6.34471 3.25987 -6.50509 4.04713 -2.45796 -0.92115 -0.20609 -1.12725
magnitude: 4.23545 au
magnitude: 10.76565 debye
zeropoint: 0.31024372 hartree
thermalvibcorrection: 0.01846967 hartree
thermalrotcorrection: 0.00141627 hartree
thermaltrasncorrection: 0.00141627 hartree
thermaltotal: -1405.98744121 hartree
thermalcorr: 0.02130222 hartree
nonthermalcorr: 0.31024372 hartree
totalcorr: 0.33154594 hartree
totalenthalpy: -1405.98649700 hartree
