program: Orca
programVersion: 5.0.2
elementType: N H C H C O C C O N H C H H H O H H S H C O C H H C H H C H N H H C O O H H
charge: 1
multiplicity: 1
keywords: wB97X-D3BJ Opt Freq def2-TZVPP def2/J RIJCOSX VeryTightSCF
keywords: PAL8 defgrid3 TightOpt
frequency: 0.00 0.00 0.00 0.00 0.00 0.00 20.10 24.41 31.52 44.34 46.64 55.05 75.51 89.60 104.90 113.19 148.51 174.11 189.42 205.38 212.78 227.13 266.83 272.79 292.34 305.77 318.32 360.99 379.33 411.09 423.78 439.27 463.09 526.25 535.33 538.57 559.58 578.80 598.15 605.67 634.74 637.82 676.45 714.90 721.55 730.17 757.22 792.88 839.57 853.16 873.31 892.62 898.44 929.86 966.69 988.27 999.05 1027.45 1058.29 1102.00 1111.00 1115.89 1137.41 1153.31 1175.14 1198.89 1213.30 1242.44 1250.19 1279.28 1287.96 1305.60 1310.72 1318.77 1351.16 1364.26 1369.87 1390.33 1404.83 1420.93 1423.23 1423.66 1467.77 1479.69 1484.30 1496.63 1499.77 1526.47 1574.55 1581.49 1627.50 1680.14 1723.46 1751.64 1865.10 1895.11 2744.68 2983.31 3088.60 3090.55 3101.27 3110.28 3122.96 3127.42 3139.36 3158.78 3161.55 3180.43 3422.76 3518.36 3629.46 3647.05 3791.13 3801.87
frequency: 20.10 24.41 31.52 44.34 46.64 55.05 75.51 89.60 104.90 113.19 148.51 174.11 189.42 205.38 212.78 227.13 266.83 272.79 292.34 305.77 318.32 360.99 379.33 411.09 423.78 439.27 463.09 526.25 535.33 538.57 559.58 578.80 598.15 605.67 634.74 637.82 676.45 714.90 721.55 730.17 757.22 792.88 839.57 853.16 873.31 892.62 898.44 929.86 966.69 988.27 999.05 1027.45 1058.29 1102.00 1111.00 1115.89 1137.41 1153.31 1175.14 1198.89 1213.30 1242.44 1250.19 1279.28 1287.96 1305.60 1310.72 1318.77 1351.16 1364.26 1369.87 1390.33 1404.83 1420.93 1423.23 1423.66 1467.77 1479.69 1484.30 1496.63 1499.77 1526.47 1574.55 1581.49 1627.50 1680.14 1723.46 1751.64 1865.10 1895.11 2744.68 2983.31 3088.60 3090.55 3101.27 3110.28 3122.96 3127.42 3139.36 3158.78 3161.55 3180.43 3422.76 3518.36 3629.46 3647.05 3791.13 3801.87
formula: C10H18N3O6S
InChI: InChI=1S/C10H18N3O6S/c11-5(10(18)19)1-2-7(14)13-6(4-20)9(17)12-3-8(15)16/h5-6,12-13,15,18,20H,1-4H2,11H3
38 atoms
N  -0.245104 3.482587 0.897771
H  0.094561 4.063139 1.648786
C  -0.53418 4.114967 -0.379401
H  -1.457778 3.737233 -0.812435
C  0.584863 3.914735 -1.395199
O  0.432549 3.386553 -2.461435
C  -0.189781 2.165592 1.137095
C  -0.710987 1.223161 0.044337
O  0.183354 1.731106 2.229711
N  0.011653 -0.024922 0.106139
H  -0.578525 1.670616 -0.941265
C  -2.203873 0.987502 0.315318
H  -0.52788 -0.875203 0.052288
H  -2.339181 0.662556 1.348675
H  -2.751511 1.920733 0.190415
O  1.750253 4.396366 -0.944538
H  2.42365 4.219077 -1.615411
H  -0.660555 5.182595 -0.201264
S  -2.937734 -0.314837 -0.697574
H  -2.722753 0.260984 -1.887717
C  1.352351 -0.052301 0.047976
O  2.017763 0.979628 -0.043666
C  2.007305 -1.409109 0.206274
H  1.277962 -2.154303 0.530461
H  2.381605 -1.720363 -0.771401
C  3.180691 -1.351461 1.18616
H  3.983959 -0.735907 0.773305
H  3.582318 -2.354973 1.321019
C  2.820806 -0.829883 2.581798
H  1.886066 -1.278922 2.926711
N  2.622152 0.660752 2.596612
H  3.035618 1.076889 1.756651
H  1.614367 0.947972 2.543197
C  3.885708 -1.253408 3.595207
O  4.289471 -2.372445 3.673985
O  4.278999 -0.23783 4.3875
H  4.926145 -0.573744 5.023853
H  3.040653 1.065592 3.433515
totalener: -1406.24571385 hartree
nucrepener: 1864.42012060 hartree
electener: -3270.66583445 hartree
oneelecener: -5612.61167430 hartree
twoeener: 2341.94583985 hartree
kineticenergy: 1400.65656615 hartree
exchangeener: -105.326769840684 hartree
correlationener: -7.054181624096 hartree
xcener: -112.380951464779 hartree
temp: 298.15 k
press: 1.00 atm
thermalcorrenthalpy: 0.00094421 hartree
totalenthalpy: -1405.99658324 hartree
totalentropycorr: -0.06579712 hartree
gibbsenthalpy: -1406.06238036 hartree
gibbsminuselec: 0.26361130 hartree
chargesum: 1.0000000
charge: -0.158126 0.196021 -0.092395 0.129205 0.292866 -0.282868 0.253751 0.054197 -0.433515 -0.143593 0.133279 -0.194001 0.167767 0.150806 0.122273 -0.269130 0.242627 0.146535 -0.125426 0.112832 0.208370 -0.435883 -0.155023 0.104770 0.134078 -0.204782 0.121305 0.142823 0.002312 0.142367 -0.052488 0.221856 0.238492 0.292438 -0.246582 -0.287974 0.253896 0.216920
charge: 0.355386 -0.002616 -0.034821 0.032508 -0.452390 0.132239 -0.352217 -0.131292 0.095430 0.348391 0.033537 -0.236863 -0.032531 0.020506 0.010021 0.368851 -0.078199 0.042100 0.508702 -0.140577 -0.381829 0.064982 -0.000769 0.031265 0.046528 0.003929 0.034961 0.045166 -0.040170 0.049351 0.604622 0.029467 -0.034460 -0.426666 0.170793 0.361244 -0.066639 0.022060
qa: -0.1581 0.1960 -0.0924 0.1292 0.2929 -0.2829 0.2538 0.0542 -0.4335 -0.1436 0.1333 -0.1940 0.1678 0.1508 0.1223 -0.2691 0.2426 0.1465 -0.1254 0.1128 0.2084 -0.4359 -0.1550 0.1048 0.1341 -0.2048 0.1213 0.1428 0.0023 0.1424 -0.0525 0.2219 0.2385 0.2924 -0.2466 -0.2880 0.2539 0.2169
va: 3.2110 1.0120 3.8569 1.0079 4.2856 2.2088 4.2283 3.7622 2.0734 3.1949 1.0416 3.9576 1.0543 1.0023 1.0076 2.2124 1.0151 0.9953 2.1788 1.0207 4.2029 2.0726 3.8430 1.0167 1.0079 3.9100 1.0101 1.0241 3.8117 1.0095 3.5797 1.0139 1.0699 4.3289 2.2576 2.1877 1.0066 1.0075
dispcorr: -0.080545993 hartree
energy: -1406.331886833814
dipole: 0.68453 0.43282 1.11735 -1.03040 1.57301 0.54261 1.24746 0.40922 1.65668
magnitude: 2.07062 au
magnitude: 5.26311 debye
zeropoint: 0.31086643 hartree
thermalvibcorrection: 0.01859042 hartree
thermalrotcorrection: 0.00141627 hartree
thermaltrasncorrection: 0.00141627 hartree
thermaltotal: -1405.99959744 hartree
thermalcorr: 0.02142296 hartree
nonthermalcorr: 0.31086643 hartree
totalcorr: 0.33228939 hartree
totalenthalpy: -1405.99865324 hartree
