program: Orca
programVersion: 5.0.2
elementType: N H C H C O C C O N H C H H H O H H S H C O C H H C H H C H N H H C O O H H
charge: 1
multiplicity: 1
keywords: wB97X-D3BJ Opt Freq def2-TZVPP def2/J RIJCOSX VeryTightSCF
keywords: PAL8 defgrid3 TightOpt
frequency: 0.00 0.00 0.00 0.00 0.00 0.00 13.57 42.48 49.85 62.42 91.59 95.56 113.66 116.21 119.13 135.15 137.74 166.40 167.36 179.84 200.76 218.39 227.27 259.27 301.48 326.92 338.36 344.51 386.86 413.40 429.83 441.81 496.05 535.89 550.23 566.23 570.76 583.16 634.91 636.28 653.65 690.35 700.93 712.47 748.52 776.90 804.23 817.79 824.98 877.17 897.18 910.90 932.68 950.20 955.60 970.15 988.81 1027.98 1046.79 1061.08 1098.78 1142.19 1160.37 1181.18 1198.91 1219.25 1233.80 1254.62 1264.39 1288.37 1295.63 1315.59 1336.02 1360.96 1377.38 1381.33 1396.66 1403.13 1415.62 1423.43 1438.60 1449.34 1475.34 1486.47 1490.94 1494.74 1501.31 1505.86 1541.42 1607.07 1614.80 1709.63 1716.87 1788.97 1796.38 1858.00 2721.81 2768.62 3073.75 3083.09 3099.34 3117.59 3121.96 3128.56 3133.22 3140.40 3160.32 3168.20 3189.51 3497.50 3570.62 3639.16 3666.03 3787.47
frequency: 13.57 42.48 49.85 62.42 91.59 95.56 113.66 116.21 119.13 135.15 137.74 166.40 167.36 179.84 200.76 218.39 227.27 259.27 301.48 326.92 338.36 344.51 386.86 413.40 429.83 441.81 496.05 535.89 550.23 566.23 570.76 583.16 634.91 636.28 653.65 690.35 700.93 712.47 748.52 776.90 804.23 817.79 824.98 877.17 897.18 910.90 932.68 950.20 955.60 970.15 988.81 1027.98 1046.79 1061.08 1098.78 1142.19 1160.37 1181.18 1198.91 1219.25 1233.80 1254.62 1264.39 1288.37 1295.63 1315.59 1336.02 1360.96 1377.38 1381.33 1396.66 1403.13 1415.62 1423.43 1438.60 1449.34 1475.34 1486.47 1490.94 1494.74 1501.31 1505.86 1541.42 1607.07 1614.80 1709.63 1716.87 1788.97 1796.38 1858.00 2721.81 2768.62 3073.75 3083.09 3099.34 3117.59 3121.96 3128.56 3133.22 3140.40 3160.32 3168.20 3189.51 3497.50 3570.62 3639.16 3666.03 3787.47
formula: C10H18N3O6S
InChI: InChI=1S/C10H18N3O6S/c11-5(10(18)19)1-2-7(14)13-6(4-20)9(17)12-3-8(15)16/h5-6,12-13,15,18,20H,1-4H2,11H3
38 atoms
N  -1.128904 2.247451 -1.905444
H  -1.771041 2.738476 -2.509087
C  0.211504 2.02328 -2.380109
H  0.919885 2.027977 -1.554731
C  0.703407 3.066275 -3.355164
O  1.865572 3.144821 -3.701898
C  -1.67592 1.900046 -0.711971
C  -0.899416 1.111974 0.368053
O  -2.809744 2.219236 -0.42313
N  0.018835 0.035452 -0.047453
H  -1.710462 0.588816 0.87573
C  -0.308955 2.081538 1.392294
H  -0.412777 -0.872084 -0.098891
H  0.504698 2.669047 0.975857
H  -1.121499 2.739599 1.694477
O  -0.238674 3.864602 -3.832965
H  0.158173 4.476517 -4.469578
H  0.322786 1.067481 -2.900843
S  0.265499 1.123483 2.823738
H  0.582552 2.168395 3.594265
C  1.356601 0.03414 -0.017318
O  2.02757 1.078011 0.007663
C  2.049665 -1.31254 0.074479
H  2.453698 -1.316994 1.09241
H  1.326754 -2.12727 0.040087
C  3.168124 -1.627849 -0.943644
H  2.730684 -2.089693 -1.827759
H  3.828056 -2.37272 -0.494585
C  4.00955 -0.473636 -1.481179
H  4.882833 -0.876366 -1.999035
N  4.498048 0.435932 -0.394038
H  3.603035 0.840185 0.023452
H  5.051011 -0.056838 0.303007
C  3.229416 0.3698 -2.496885
O  2.331734 -0.099249 -3.142502
O  3.678456 1.610685 -2.559816
H  3.057436 2.176837 -3.103069
H  5.043613 1.20136 -0.788416
totalener: -1406.22884771 hartree
nucrepener: 1931.72438755 hartree
electener: -3337.95323526 hartree
oneelecener: -5747.09663739 hartree
twoeener: 2409.14340213 hartree
kineticenergy: 1400.64085185 hartree
exchangeener: -105.330238960177 hartree
correlationener: -7.060789735921 hartree
xcener: -112.391028696099 hartree
temp: 298.15 k
press: 1.00 atm
thermalcorrenthalpy: 0.00094421 hartree
totalenthalpy: -1405.98366316 hartree
totalentropycorr: -0.06467503 hartree
gibbsenthalpy: -1406.04833818 hartree
gibbsminuselec: 0.26384239 hartree
chargesum: 1.0000000
charge: -0.167992 0.190718 -0.131048 0.113497 0.383358 -0.341664 0.176328 -0.011060 -0.309853 -0.167992 0.154613 -0.157796 0.193323 0.120938 0.161580 -0.245739 0.248566 0.154375 -0.168146 0.118981 0.355900 -0.450998 -0.240242 0.143031 0.106395 -0.212376 0.139447 0.141794 -0.000990 0.165175 -0.070422 0.230020 0.219295 0.287159 -0.301325 -0.331673 0.271481 0.233341
charge: 0.324772 -0.009422 -0.052824 0.023138 -0.392123 0.163917 -0.386897 -0.123779 0.109545 0.355455 0.049687 -0.222145 -0.005399 -0.006005 0.020580 0.399933 -0.065448 0.032859 0.475085 -0.143005 -0.365559 0.141421 0.002116 0.043146 0.036912 0.003971 0.045323 0.033249 -0.052903 0.047115 0.599347 -0.048436 0.037808 -0.465098 0.141525 0.357734 -0.145777 0.040181
qa: -0.1680 0.1907 -0.1310 0.1135 0.3834 -0.3417 0.1763 -0.0111 -0.3099 -0.1680 0.1546 -0.1578 0.1933 0.1209 0.1616 -0.2457 0.2486 0.1544 -0.1681 0.1190 0.3559 -0.4510 -0.2402 0.1430 0.1064 -0.2124 0.1394 0.1418 -0.0010 0.1652 -0.0704 0.2300 0.2193 0.2872 -0.3013 -0.3317 0.2715 0.2333
va: 3.1062 1.0266 3.8356 1.0364 4.2261 2.1590 4.3907 3.7235 2.2181 3.2127 1.0262 3.9502 1.0027 1.0132 1.0100 2.2713 1.0118 1.0002 2.1675 1.0203 4.0064 2.0192 3.8653 1.0115 1.0247 3.8487 1.0213 1.0000 3.8210 0.9958 3.5752 1.0835 0.9804 4.3714 2.1882 2.1820 1.0774 0.9876
dispcorr: -0.083839952 hartree
energy: -1406.317805884842
dipole: 9.16820 -5.24925 3.91896 -7.60219 6.16357 -1.43862 5.02108 -4.71535 0.30573
magnitude: 4.18585 au
magnitude: 10.63958 debye
zeropoint: 0.31117977 hartree
thermalvibcorrection: 0.01805961 hartree
thermalrotcorrection: 0.00141627 hartree
thermaltrasncorrection: 0.00141627 hartree
thermaltotal: -1405.98573396 hartree
thermalcorr: 0.02089215 hartree
nonthermalcorr: 0.31117977 hartree
totalcorr: 0.33207193 hartree
totalenthalpy: -1405.98478975 hartree
