program: Orca
programVersion: 5.0.2
elementType: N H C H C O C C O N H C H H H O H H S H C O C H H C H H C H N H H C O O H H
charge: 1
multiplicity: 1
keywords: wB97X-D3BJ Opt Freq def2-TZVPP def2/J RIJCOSX VeryTightSCF
keywords: PAL8 defgrid3 TightOpt
frequency: 0.00 0.00 0.00 0.00 0.00 0.00 38.57 53.81 71.45 75.22 83.49 89.08 102.02 121.15 127.56 133.36 159.78 166.10 185.42 225.05 238.71 261.32 269.54 287.53 303.66 323.41 330.63 346.30 367.81 405.70 438.04 448.97 488.35 522.57 532.80 572.87 575.50 596.77 621.72 642.04 650.71 680.79 693.62 695.12 728.17 750.44 764.70 772.45 829.50 870.93 890.01 905.36 914.72 939.76 968.82 991.16 1012.63 1031.62 1045.82 1075.17 1107.03 1131.22 1158.03 1176.57 1183.67 1232.42 1247.18 1259.49 1292.00 1298.08 1307.60 1322.08 1332.85 1354.72 1367.61 1372.95 1388.55 1391.09 1399.82 1423.23 1427.63 1438.47 1465.35 1467.63 1474.55 1483.43 1497.93 1513.25 1522.05 1583.18 1614.57 1695.40 1736.17 1797.58 1808.99 1829.11 2799.49 2955.93 2983.06 3084.66 3088.58 3090.32 3096.03 3118.27 3128.54 3138.88 3149.70 3206.11 3254.76 3422.51 3569.40 3615.01 3641.30 3801.66
frequency: 38.57 53.81 71.45 75.22 83.49 89.08 102.02 121.15 127.56 133.36 159.78 166.10 185.42 225.05 238.71 261.32 269.54 287.53 303.66 323.41 330.63 346.30 367.81 405.70 438.04 448.97 488.35 522.57 532.80 572.87 575.50 596.77 621.72 642.04 650.71 680.79 693.62 695.12 728.17 750.44 764.70 772.45 829.50 870.93 890.01 905.36 914.72 939.76 968.82 991.16 1012.63 1031.62 1045.82 1075.17 1107.03 1131.22 1158.03 1176.57 1183.67 1232.42 1247.18 1259.49 1292.00 1298.08 1307.60 1322.08 1332.85 1354.72 1367.61 1372.95 1388.55 1391.09 1399.82 1423.23 1427.63 1438.47 1465.35 1467.63 1474.55 1483.43 1497.93 1513.25 1522.05 1583.18 1614.57 1695.40 1736.17 1797.58 1808.99 1829.11 2799.49 2955.93 2983.06 3084.66 3088.58 3090.32 3096.03 3118.27 3128.54 3138.88 3149.70 3206.11 3254.76 3422.51 3569.40 3615.01 3641.30 3801.66
formula: C10H18N3O6S
InChI: InChI=1S/C10H18N3O6S/c11-5(10(18)19)1-2-7(14)13-6(4-20)9(17)12-3-8(15)16/h5-6,12-13,15,18,20H,1-4H2,11H3
38 atoms
N  -2.221993 -0.096737 -1.94043
H  -3.16761 -0.315856 -2.220509
C  -1.152393 -0.713574 -2.687054
H  -1.419326 -1.750395 -2.912392
C  -0.785287 -0.088293 -4.029254
O  0.237545 -0.41951 -4.591693
C  -2.216579 0.783249 -0.877013
C  -0.950219 1.114265 -0.059849
O  -3.246376 1.317174 -0.536761
N  0.01008 0.008281 -0.031964
H  -1.338416 1.251605 0.952516
C  -0.417664 2.472296 -0.520489
H  -0.413374 -0.901444 0.060992
H  -1.242046 3.17355 -0.390363
H  0.407149 2.803516 0.100904
O  -1.63305 0.742381 -4.600702
H  -2.31591 1.012019 -3.972631
H  -0.235974 -0.735294 -2.115343
S  0.032158 2.564516 -2.265551
H  1.264503 2.064583 -2.164102
C  1.352187 0.010381 -0.023514
O  2.041765 1.034177 -0.00032
C  1.96694 -1.380015 -0.07868
H  1.847484 -1.836196 0.908108
H  1.389291 -1.987885 -0.775425
C  3.451157 -1.443811 -0.458596
H  3.674306 -2.482961 -0.699664
H  4.068476 -1.202583 0.410824
C  3.946464 -0.579559 -1.629134
H  4.81045 -1.061384 -2.091293
N  4.391884 0.764846 -1.139502
H  3.614589 1.091033 -0.510318
H  5.28233 0.732935 -0.65103
C  2.956755 -0.261483 -2.758883
O  2.950607 0.838736 -3.258747
O  2.188427 -1.270666 -3.081324
H  1.504389 -0.989352 -3.768623
H  4.433319 1.400573 -1.943033
totalener: -1406.22213804 hartree
nucrepener: 1987.00080543 hartree
electener: -3393.22294347 hartree
oneelecener: -5856.70885894 hartree
twoeener: 2463.48591547 hartree
kineticenergy: 1400.64303060 hartree
exchangeener: -105.326380210384 hartree
correlationener: -7.063915872748 hartree
xcener: -112.390296083133 hartree
temp: 298.15 k
press: 1.00 atm
thermalcorrenthalpy: 0.00094421 hartree
totalenthalpy: -1405.98067995 hartree
totalentropycorr: -0.06406793 hartree
gibbsenthalpy: -1406.04474788 hartree
gibbsminuselec: 0.26411828 hartree
chargesum: 1.0000000
charge: -0.257741 0.202844 -0.047619 0.157776 0.304257 -0.307550 0.179481 0.016059 -0.284001 -0.166351 0.154171 -0.158638 0.182395 0.159491 0.137695 -0.185001 0.232541 0.018178 -0.138651 0.113308 0.275815 -0.440955 -0.195744 0.159524 0.133608 -0.220190 0.137866 0.116760 0.014784 0.157921 -0.063404 0.234817 0.221193 0.291438 -0.326876 -0.307976 0.268684 0.230094
charge: 0.307735 -0.011809 -0.074606 0.042293 -0.434909 0.186384 -0.387115 -0.118711 0.128195 0.353895 0.048491 -0.235431 -0.005013 0.027769 0.004200 0.426319 -0.092397 0.008430 0.540191 -0.165310 -0.363164 0.126950 -0.010237 0.045045 0.029850 0.005079 0.045793 0.034243 -0.044305 0.046668 0.605332 -0.036228 0.036640 -0.467189 0.127226 0.380375 -0.144994 0.034310
qa: -0.2577 0.2028 -0.0476 0.1578 0.3043 -0.3075 0.1795 0.0161 -0.2840 -0.1664 0.1542 -0.1586 0.1824 0.1595 0.1377 -0.1850 0.2325 0.0182 -0.1387 0.1133 0.2758 -0.4410 -0.1957 0.1595 0.1336 -0.2202 0.1379 0.1168 0.0148 0.1579 -0.0634 0.2348 0.2212 0.2914 -0.3269 -0.3080 0.2687 0.2301
va: 3.0252 1.0064 3.8884 0.9945 4.3160 2.1987 4.3524 3.7449 2.2456 3.2097 1.0152 3.8694 1.0043 1.0098 1.0162 2.2905 1.0230 1.0623 2.2075 1.0391 4.1232 2.0533 3.7874 0.9997 1.0113 3.9173 1.0045 1.0079 3.8327 0.9959 3.6002 1.0641 0.9823 4.3413 2.1511 2.2138 1.0777 1.0065
dispcorr: -0.087069586 hartree
energy: -1406.314766175789
dipole: 10.25484 -6.85910 3.39574 -6.76337 4.71252 -2.05084 9.79452 -7.53114 2.26338
magnitude: 4.56727 au
magnitude: 11.60907 debye
zeropoint: 0.31134243 hartree
thermalvibcorrection: 0.01767874 hartree
thermalrotcorrection: 0.00141627 hartree
thermaltrasncorrection: 0.00141627 hartree
thermaltotal: -1405.98291247 hartree
thermalcorr: 0.02051128 hartree
nonthermalcorr: 0.31134243 hartree
totalcorr: 0.33185371 hartree
totalenthalpy: -1405.98196826 hartree
