program: Orca
programVersion: 5.0.2
elementType: N H C H C O C C O N H C H H H O H H S H C O C H H C H H C H N H H C O O H H
charge: 1
multiplicity: 1
keywords: wB97X-D3BJ Opt Freq def2-TZVPP def2/J RIJCOSX VeryTightSCF
keywords: PAL8 defgrid3 TightOpt
frequency: 0.00 0.00 0.00 0.00 0.00 0.00 27.79 39.64 55.90 67.18 72.91 84.11 102.55 113.43 121.23 133.09 148.97 167.54 186.97 195.99 205.51 236.71 266.29 289.57 293.49 326.12 351.07 368.02 392.02 402.92 433.55 445.35 492.72 508.96 516.88 521.84 540.64 564.54 591.89 642.77 654.31 663.25 677.75 722.27 736.95 742.36 763.97 810.80 824.68 855.99 887.27 899.07 920.32 941.31 967.31 993.83 1014.30 1022.81 1052.22 1097.04 1111.80 1132.88 1155.06 1170.87 1182.27 1194.83 1209.98 1212.08 1229.14 1275.05 1276.88 1292.66 1298.86 1334.19 1336.96 1357.64 1365.06 1386.84 1398.42 1424.92 1437.45 1448.59 1450.26 1482.61 1494.88 1502.48 1520.01 1538.27 1567.39 1576.08 1671.43 1683.58 1723.24 1748.85 1812.53 1851.03 2768.04 3080.84 3100.03 3105.15 3113.09 3119.25 3135.76 3152.03 3157.71 3162.07 3204.18 3246.88 3249.87 3381.12 3606.16 3684.43 3788.96 3798.68
frequency: 27.79 39.64 55.90 67.18 72.91 84.11 102.55 113.43 121.23 133.09 148.97 167.54 186.97 195.99 205.51 236.71 266.29 289.57 293.49 326.12 351.07 368.02 392.02 402.92 433.55 445.35 492.72 508.96 516.88 521.84 540.64 564.54 591.89 642.77 654.31 663.25 677.75 722.27 736.95 742.36 763.97 810.80 824.68 855.99 887.27 899.07 920.32 941.31 967.31 993.83 1014.30 1022.81 1052.22 1097.04 1111.80 1132.88 1155.06 1170.87 1182.27 1194.83 1209.98 1212.08 1229.14 1275.05 1276.88 1292.66 1298.86 1334.19 1336.96 1357.64 1365.06 1386.84 1398.42 1424.92 1437.45 1448.59 1450.26 1482.61 1494.88 1502.48 1520.01 1538.27 1567.39 1576.08 1671.43 1683.58 1723.24 1748.85 1812.53 1851.03 2768.04 3080.84 3100.03 3105.15 3113.09 3119.25 3135.76 3152.03 3157.71 3162.07 3204.18 3246.88 3249.87 3381.12 3606.16 3684.43 3788.96 3798.68
formula: C10H18N3O6S
InChI: InChI=1S/C10H18N3O6S/c11-5(10(18)19)1-2-7(14)13-6(4-20)9(17)12-3-8(15)16/h5-6,12-13,15,18,20H,1-4H2,11H3
38 atoms
N  -0.392516 1.872022 -3.018483
H  -0.313905 1.571913 -3.980689
C  0.187258 3.16731 -2.75424
H  -0.361331 3.946547 -3.286526
C  1.639871 3.224237 -3.192653
O  2.251699 2.324804 -3.72652
C  -0.48669 0.80864 -2.189954
C  -0.854624 0.894974 -0.692789
O  -0.374103 -0.331283 -2.642927
N  0.147785 0.117696 0.026056
H  -1.783449 0.320395 -0.65766
C  -1.12775 2.227291 0.000799
H  -0.143733 -0.7285 0.483265
H  -1.453772 1.98763 1.011615
H  -0.221989 2.825858 0.08367
O  2.161922 4.417656 -2.94824
H  3.078626 4.431052 -3.256505
H  0.148428 3.422396 -1.703744
S  -2.473155 3.111268 -0.839825
H  -2.880543 3.807414 0.225713
C  1.451954 0.279459 -0.281896
O  1.830183 1.223836 -0.969392
C  2.408568 -0.811377 0.131029
H  3.325782 -0.340324 0.486256
H  2.002481 -1.41984 0.940427
C  2.721186 -1.721587 -1.070005
H  1.82101 -2.250269 -1.397373
H  3.428001 -2.479962 -0.73554
C  3.344447 -0.997434 -2.274995
H  3.958843 -0.165762 -1.928954
N  2.339316 -0.450578 -3.237187
H  1.35384 -0.646996 -2.984791
H  2.391959 0.577977 -3.330137
C  4.237228 -1.923989 -3.099586
O  4.040808 -2.14989 -4.265067
O  5.237912 -2.416533 -2.380416
H  5.781891 -2.983901 -2.945502
H  2.534552 -0.879107 -4.151019
totalener: -1406.24435436 hartree
nucrepener: 1909.07174323 hartree
electener: -3315.31609759 hartree
oneelecener: -5702.00659992 hartree
twoeener: 2386.69050232 hartree
kineticenergy: 1401.52840162 hartree
exchangeener: -105.477658220319 hartree
correlationener: -7.065824407708 hartree
xcener: -112.543482628027 hartree
temp: 298.15 k
press: 1.00 atm
thermalcorrenthalpy: 0.00094421 hartree
totalenthalpy: -1405.99444830 hartree
totalentropycorr: -0.06824538 hartree
gibbsenthalpy: -1406.06269368 hartree
gibbsminuselec: 0.26436664 hartree
chargesum: 1.0000000
charge: -0.151475 0.178835 -0.073735 0.172705 0.355980 -0.383043 0.181534 0.033914 -0.391562 -0.168661 0.148412 -0.179051 0.187262 0.131626 0.110239 -0.234957 0.243987 0.134831 -0.132455 0.122614 0.238367 -0.427493 -0.163465 0.123687 0.108160 -0.200284 0.119128 0.136048 0.031354 0.141812 -0.095474 0.224132 0.245514 0.305268 -0.296863 -0.246852 0.253170 0.216793
charge: 0.337381 -0.004158 -0.053390 0.044116 -0.416501 0.113528 -0.364457 -0.132825 0.084690 0.352726 0.051769 -0.235662 -0.014569 0.012985 -0.003486 0.404326 -0.072197 0.032103 0.496750 -0.142221 -0.379963 0.079887 0.001380 0.041714 0.032897 0.006447 0.033333 0.039111 -0.046120 0.047955 0.606801 -0.012113 -0.012922 -0.428056 0.141906 0.398038 -0.064915 0.023715
qa: -0.1515 0.1788 -0.0737 0.1727 0.3560 -0.3830 0.1815 0.0339 -0.3916 -0.1687 0.1484 -0.1791 0.1873 0.1316 0.1102 -0.2350 0.2440 0.1348 -0.1325 0.1226 0.2384 -0.4275 -0.1635 0.1237 0.1082 -0.2003 0.1191 0.1360 0.0314 0.1418 -0.0955 0.2241 0.2455 0.3053 -0.2969 -0.2469 0.2532 0.2168
va: 3.1429 1.0271 3.8128 1.0003 4.2542 2.0903 4.2807 3.7602 2.1085 3.1998 1.0184 4.0763 1.0102 1.0035 1.0003 2.2801 1.0146 1.0225 2.1936 1.0170 4.2004 2.0697 3.8770 1.0207 1.0156 3.8192 1.0175 1.0237 3.8210 1.0242 3.5927 1.0601 1.0488 4.3210 2.1962 2.2609 1.0059 1.0210
dispcorr: -0.084200568 hartree
energy: -1406.335310301084
dipole: 0.79445 0.50769 1.30214 -3.10593 2.32238 -0.78355 7.17275 -6.31641 0.85635
magnitude: 1.74438 au
magnitude: 4.43385 debye
zeropoint: 0.31180199 hartree
thermalvibcorrection: 0.01804460 hartree
thermalrotcorrection: 0.00141627 hartree
thermaltrasncorrection: 0.00141627 hartree
thermaltotal: -1406.00263117 hartree
thermalcorr: 0.02087714 hartree
nonthermalcorr: 0.31180199 hartree
totalcorr: 0.33267913 hartree
totalenthalpy: -1406.00168696 hartree
