program: Orca
programVersion: 5.0.2
elementType: N H C H C O C C O N H C H H H O H H S H C O C H H C H H C H N H H C O O H H
charge: 1
multiplicity: 1
keywords: wB97X-D3BJ Opt Freq def2-TZVPP def2/J RIJCOSX VeryTightSCF
keywords: PAL8 defgrid3 TightOpt
frequency: 0.00 0.00 0.00 0.00 0.00 0.00 13.82 19.91 27.03 39.75 49.17 55.74 63.23 89.93 91.25 93.38 113.72 145.67 165.85 192.53 226.92 248.23 274.80 287.03 294.49 300.97 330.15 353.59 398.79 416.80 425.37 437.86 488.39 510.58 535.59 576.92 595.27 611.05 627.16 633.46 658.99 670.99 695.31 721.89 727.86 752.62 762.73 793.76 830.28 844.81 866.76 893.98 902.11 942.79 980.43 994.93 1026.63 1037.17 1064.55 1089.38 1119.42 1138.95 1150.23 1163.91 1192.29 1210.05 1217.31 1228.38 1232.03 1264.36 1298.85 1305.74 1311.77 1326.58 1338.46 1363.74 1365.98 1371.95 1385.31 1410.56 1422.96 1460.44 1466.14 1476.03 1480.32 1495.28 1497.29 1535.62 1570.97 1605.58 1612.57 1686.38 1712.02 1778.87 1853.58 1894.19 2318.19 2750.96 3076.81 3096.13 3112.63 3112.91 3121.77 3138.78 3153.57 3164.49 3173.27 3188.34 3412.63 3566.98 3600.21 3610.22 3685.27 3781.38
frequency: 13.82 19.91 27.03 39.75 49.17 55.74 63.23 89.93 91.25 93.38 113.72 145.67 165.85 192.53 226.92 248.23 274.80 287.03 294.49 300.97 330.15 353.59 398.79 416.80 425.37 437.86 488.39 510.58 535.59 576.92 595.27 611.05 627.16 633.46 658.99 670.99 695.31 721.89 727.86 752.62 762.73 793.76 830.28 844.81 866.76 893.98 902.11 942.79 980.43 994.93 1026.63 1037.17 1064.55 1089.38 1119.42 1138.95 1150.23 1163.91 1192.29 1210.05 1217.31 1228.38 1232.03 1264.36 1298.85 1305.74 1311.77 1326.58 1338.46 1363.74 1365.98 1371.95 1385.31 1410.56 1422.96 1460.44 1466.14 1476.03 1480.32 1495.28 1497.29 1535.62 1570.97 1605.58 1612.57 1686.38 1712.02 1778.87 1853.58 1894.19 2318.19 2750.96 3076.81 3096.13 3112.63 3112.91 3121.77 3138.78 3153.57 3164.49 3173.27 3188.34 3412.63 3566.98 3600.21 3610.22 3685.27 3781.38
formula: C10H18N3O6S
InChI: InChI=1S/C10H18N3O6S/c11-5(10(18)19)1-2-7(14)13-6(4-20)9(17)12-3-8(15)16/h5-6,12-13,15,18,20H,1-4H2,11H3
38 atoms
N  -2.79026 1.650385 1.407227
H  -3.66529 1.273172 1.745334
C  -2.298051 2.84205 2.079558
H  -2.091774 2.641109 3.130698
C  -3.312679 3.990113 2.032206
O  -3.690226 4.540911 3.022884
C  -2.155336 0.814241 0.560476
C  -0.81365 1.216711 -0.058275
O  -2.623588 -0.263274 0.228439
N  0.011694 0.01507 0.009037
H  -0.299802 2.009031 0.4778
C  -1.011115 1.612928 -1.528768
H  -0.506173 -0.853714 -0.011173
H  -0.049936 1.917733 -1.942021
H  -1.366592 0.748807 -2.087585
O  -3.736781 4.338075 0.810864
H  -3.267302 3.840165 0.12328
H  -1.381422 3.187691 1.604445
S  -2.1538 2.988407 -1.803057
H  -3.266597 2.252266 -1.912361
C  1.336999 0.031302 0.012815
O  1.974001 1.103019 0.01066
C  2.038367 -1.313366 -0.000022
H  1.36682 -2.0747 0.398262
H  2.206176 -1.578184 -1.049244
C  3.352944 -1.350537 0.793663
H  3.587033 -2.391503 1.015513
H  3.229417 -0.84759 1.755629
C  4.58905 -0.774443 0.092907
H  5.471162 -0.99762 0.695954
N  4.504063 0.704087 -0.097419
H  4.889016 0.931832 -1.020323
H  3.450068 0.986408 -0.069949
C  4.829093 -1.367691 -1.292914
O  4.976793 -0.684843 -2.271708
O  4.859749 -2.693353 -1.261046
H  5.05237 -3.029258 -2.148919
H  5.010875 1.214203 0.620335
totalener: -1406.23644287 hartree
nucrepener: 1757.58869371 hartree
electener: -3163.82513658 hartree
oneelecener: -5398.75946554 hartree
twoeener: 2234.93432896 hartree
kineticenergy: 1400.63048551 hartree
exchangeener: -105.318872981561 hartree
correlationener: -7.051187562588 hartree
xcener: -112.370060544149 hartree
temp: 298.15 k
press: 1.00 atm
thermalcorrenthalpy: 0.00094421 hartree
totalenthalpy: -1405.98515985 hartree
totalentropycorr: -0.06659458 hartree
gibbsenthalpy: -1406.05175444 hartree
gibbsminuselec: 0.26140092 hartree
chargesum: 1.0000000
charge: -0.176399 0.205580 -0.135416 0.143659 0.266267 -0.259333 0.183422 0.096041 -0.362746 -0.172874 0.100569 -0.195140 0.196364 0.135250 0.138367 -0.236902 0.203738 0.122580 -0.134479 0.137289 0.291702 -0.430461 -0.166697 0.132890 0.120948 -0.206528 0.149270 0.136062 -0.017920 0.154922 -0.078035 0.218708 0.216151 0.280114 -0.289487 -0.247081 0.259479 0.220126
charge: 0.332590 0.003207 -0.047539 0.032302 -0.455889 0.150045 -0.400015 -0.119984 0.082737 0.374275 0.023163 -0.234054 -0.003841 0.011400 0.015719 0.374673 -0.166101 0.022499 0.551473 -0.133610 -0.334439 0.147978 0.002337 0.041752 0.041726 0.004642 0.046082 0.037060 -0.056251 0.047841 0.593166 0.025398 -0.086631 -0.441534 0.143157 0.403205 -0.061939 0.033401
qa: -0.1764 0.2056 -0.1354 0.1437 0.2663 -0.2593 0.1834 0.0960 -0.3627 -0.1729 0.1006 -0.1951 0.1964 0.1352 0.1384 -0.2369 0.2037 0.1226 -0.1345 0.1373 0.2917 -0.4305 -0.1667 0.1329 0.1209 -0.2065 0.1493 0.1361 -0.0179 0.1549 -0.0780 0.2187 0.2162 0.2801 -0.2895 -0.2471 0.2595 0.2201
va: 3.1162 1.0020 3.8510 1.0088 4.3696 2.2435 4.3397 3.7874 2.1601 3.3433 1.0372 3.9470 1.0329 1.0053 1.0136 2.1935 1.0941 0.9951 2.2271 1.0150 4.1144 2.0849 3.8369 1.0062 1.0120 3.8894 1.0082 1.0041 3.9295 1.0006 3.5294 1.0161 1.1194 4.3450 2.1986 2.2676 1.0013 0.9830
dispcorr: -0.077655090 hartree
energy: -1406.318458474061
dipole: 12.89978 -6.78922 6.11056 -8.27810 5.04769 -3.23042 1.14756 -1.56557 -0.41800
magnitude: 6.92454 au
magnitude: 17.60079 debye
zeropoint: 0.30983313 hartree
thermalvibcorrection: 0.01861559 hartree
thermalrotcorrection: 0.00141627 hartree
thermaltrasncorrection: 0.00141627 hartree
thermaltotal: -1405.98717722 hartree
thermalcorr: 0.02144813 hartree
nonthermalcorr: 0.30983313 hartree
totalcorr: 0.33128126 hartree
totalenthalpy: -1405.98623301 hartree
