program: Gaussian 09
title: 000048482
version: EM64L-G09RevD.01
frameworkgroup: C1[X(C9H14N2O4)]
method: RPBEPBE
basis: SDD
operation: Freq
keyword: #p
keyword: freq=noraman
keyword: PBEPBE/SDD
title: #p freq=noraman PBEPBE/SDD
converged: YES YES NO NO
title: Mulliken charges:
elementType: O O O O N N C C C C C C C C C H H H H H H H H H H H H H H
charge: -0.288761 -0.221823 -0.221762 -0.223868 -0.363862 -0.364146 0.059959 -0.408391 -0.302489 0.176274 0.177282 -0.705061 0.170486 -0.199323 -0.677868 0.233209 0.233551 0.225300 0.224561 0.230299 0.229992 0.227477 0.363714 0.363644 0.196444 0.196532 0.207491 0.230554 0.230585
chargesum: 0.00000
title: Mulliken charges with hydrogens summed into heavy atoms:
elementType: O O O O N N C C C C C C C C C
charge: -0.288761 -0.221823 -0.221762 -0.223868 -0.000148 -0.000502 0.059959 0.058369 0.147373 0.176274 0.177282 -0.017292 0.170486 0.193652 -0.009238
polarizability: 1.13547640e+02 1.03624026e+00 1.36881706e+02 1.50559743e-01 -4.27620386e-02 1.14325939e+02
1716.lowfreq: -2.6496 -0.0009 0.0005 0.0005 5.7315 13.3683 31.0765 38.6019 61.4596
frequency: 31.0729 38.5873 61.3993 82.1462 83.7449 134.0377 150.7161 152.4483 172.2946 193.5990 217.5193 234.2303 263.0380 302.7876 306.5260 360.0414 363.6261 411.4584 451.1791 482.2823 483.1084 587.6416 630.3694 647.9205 681.5072 712.6895 753.8983 755.2592 771.3725 791.6292 816.4235 843.3469 877.1341 959.2886 990.9696 999.7783 1038.2951 1041.8213 1067.1057 1094.4764 1112.3186 1134.8077 1150.8187 1153.7119 1197.8714 1240.6656 1254.3417 1301.7725 1312.5434 1313.4462 1352.8461 1371.8447 1377.2566 1378.9442 1388.5322 1398.6780 1401.2480 1456.1035 1461.4123 1466.5892 1479.4919 1480.0803 1483.4879 1492.2843 1618.9143 1656.6563 1678.2121 2933.3499 2954.1684 2984.1379 2984.9247 2996.8579 3010.7551 3017.9522 3063.0799 3084.5759 3088.2759 3095.2289 3103.7775 3521.3570 3523.0838
redmass: 7.6800 4.2128 1.6522 4.0262 2.4642 4.6863 6.0598 6.3039 6.1527 1.3338 4.4913 1.1787 1.8021 2.3220 3.6781 11.3450 7.9323 5.6289 3.8347 4.0643 9.7308 9.4331 3.9241 2.3340 2.3844 5.3760 4.2316 1.5965 1.4640 1.9155 1.0895 3.0085 1.8163 2.2379 3.6965 2.7470 3.2095 1.5400 5.5534 4.4647 2.2297 1.4513 3.4741 1.9686 1.5719 1.7854 1.1419 2.4245 1.5623 1.3416 1.5522 8.9282 1.8989 1.4585 1.5041 1.2170 1.3406 1.0838 1.0403 1.0886 1.0516 1.0500 1.0408 1.0789 6.9582 8.5600 5.3240 1.0553 1.0540 1.0363 1.1072 1.0360 1.0593 1.1089 1.1015 1.0985 1.1031 1.0991 1.1012 1.0756 1.0781
irintensity: 1.2720 0.9225 1.5663 0.6903 0.0346 3.3048 1.0787 7.6401 5.4873 0.0122 1.2452 1.7793 0.8308 5.7516 0.1741 25.3251 18.9157 7.9107 2.6815 16.5989 17.3104 1.6828 4.2884 0.0176 33.1373 2.9933 23.2751 1.1881 1.8795 227.0005 4.2439 4.2377 1.5729 13.8159 2.7709 1.2601 15.9179 0.3328 194.9412 1.5521 10.8648 3.0165 3.1869 5.9778 7.6614 34.9235 0.5460 212.8375 53.0826 24.4980 80.9131 225.8202 0.5401 3.0737 32.2592 5.9829 23.8305 10.6435 11.8382 27.4699 7.1111 5.7927 14.2823 8.3456 310.9862 70.0758 594.2916 56.5953 51.4561 21.2506 46.2461 18.7666 19.1222 14.4912 1.4608 34.6394 29.2108 33.1041 32.5824 83.0256 39.6883
temp: 298.150 k
press: 1.00000 atm
elementType: 8 8 8 8 7 7 6 6 6 6 6 6 6 6 6 1 1 1 1 1 1 1 1 1 1 1 1 1 1
symmnumber: 1
zpe: 607183.6 jmol-1
zpe.correction: 0.231264 hartree
zpe.thermalcorrener: 0.247106 hartree
zpe.thermalcorrenthalpy: 0.248050 hartree
zpe.thermalcorrgfe: 0.187148 hartree
zpe.sumelectzpe: -760.635540 hartree
zpe.sumelectthermal: -760.619698 hartree
zpe.sumelectthermalent: -760.618754 hartree
zpe.sumelectthermalfe: -760.679656 hartree
dipole: -1.1746 -2.0594 -0.0005
dipole: 2.3709
quadrupole: -78.1447 -94.5775 -98.8387
quadrupole: 0.0105 -0.0993 -0.0010
quadrupole: 12.3756 -4.0572 -8.3184 0.0105 -0.0993 -0.0010
hfenergy: -760.8668044 hartree
pointgroup: C01 [X(C9H14N2O4)]
dipole: 0.1362066 0.9221785 -0.0329481 debye
polarizability: 115.9230803|-7.136263|134.4826948|0.0772898|-0.6535619|114.3495105 unknown
InChI: InChI=1S/C9H14N2O4/c1-3-9(5-15-4-2)6(12)10-8(14)11-7(9)13/h10-11H,3-5H2,1-2H3
charge 0 multiplicity 1
29 atoms
O  1.656973 1.014108 -0.02193
O  -0.698792 0.449182 2.445438
O  -0.705383 0.295503 -2.42228
O  0.276949 -3.458889 0.131268
N  -0.245408 -1.477164 1.2529
N  -0.249885 -1.552174 -1.111801
C  -0.725145 0.652044 0.002744
C  -2.125965 1.349432 -0.017404
C  0.384948 1.736903 -0.033652
C  -0.55755 -0.111603 1.328348
C  -0.560803 -0.193447 -1.272389
C  -3.315769 0.368286 0.011677
C  -0.041475 -2.244841 0.093273
C  2.826807 1.910382 -0.061678
C  4.078193 1.034947 -0.050355
H  -2.172676 1.967388 -0.932656
H  -2.171813 2.021586 0.858853
H  0.288671 2.388744 0.859594
H  0.277078 2.338058 -0.960526
H  -3.313414 -0.301898 -0.86741
H  -3.311405 -0.252654 0.9262
H  -4.267461 0.928027 -0.002498
H  -0.104197 -1.971792 2.139744
H  -0.111182 -2.101811 -1.966063
H  2.779972 2.533683 -0.981202
H  2.800695 2.587075 0.820092
H  4.986678 1.663262 -0.080491
H  4.109706 0.416539 0.86305
H  4.087652 0.362623 -0.925345
