program: Orca
programVersion: 5.0.2
elementType: N H C H C O C C O N H C H H H O H H S H C O C H H C H H C H N H H C O O H H
charge: 1
multiplicity: 1
keywords: wB97X-D3BJ Opt Freq def2-TZVPP def2/J RIJCOSX VeryTightSCF
keywords: PAL8 defgrid3 TightOpt
frequency: 0.00 0.00 0.00 0.00 0.00 0.00 18.49 25.73 37.75 57.10 64.44 66.31 80.15 86.89 98.39 119.08 135.29 158.41 161.51 185.04 191.49 203.90 215.02 218.81 232.12 282.69 294.03 312.19 348.20 365.30 454.30 478.03 479.85 489.87 495.25 503.12 514.96 582.41 585.42 602.40 618.95 651.66 658.49 717.65 740.24 755.85 769.94 792.79 846.20 847.92 863.58 886.76 907.18 931.38 958.14 959.51 1016.05 1042.06 1052.50 1091.63 1117.05 1124.36 1141.32 1165.10 1172.16 1205.14 1206.03 1241.05 1251.09 1276.83 1296.46 1311.89 1317.92 1322.98 1348.65 1350.06 1363.80 1377.86 1389.18 1399.47 1437.22 1438.69 1469.33 1471.98 1485.64 1500.82 1504.61 1510.33 1539.45 1584.52 1625.08 1683.62 1746.68 1819.78 1850.91 1855.35 2764.64 3075.76 3088.58 3103.19 3109.35 3114.10 3121.39 3139.09 3149.47 3151.83 3170.61 3311.85 3392.93 3484.06 3611.22 3677.86 3785.70 3837.47
frequency: 18.49 25.73 37.75 57.10 64.44 66.31 80.15 86.89 98.39 119.08 135.29 158.41 161.51 185.04 191.49 203.90 215.02 218.81 232.12 282.69 294.03 312.19 348.20 365.30 454.30 478.03 479.85 489.87 495.25 503.12 514.96 582.41 585.42 602.40 618.95 651.66 658.49 717.65 740.24 755.85 769.94 792.79 846.20 847.92 863.58 886.76 907.18 931.38 958.14 959.51 1016.05 1042.06 1052.50 1091.63 1117.05 1124.36 1141.32 1165.10 1172.16 1205.14 1206.03 1241.05 1251.09 1276.83 1296.46 1311.89 1317.92 1322.98 1348.65 1350.06 1363.80 1377.86 1389.18 1399.47 1437.22 1438.69 1469.33 1471.98 1485.64 1500.82 1504.61 1510.33 1539.45 1584.52 1625.08 1683.62 1746.68 1819.78 1850.91 1855.35 2764.64 3075.76 3088.58 3103.19 3109.35 3114.10 3121.39 3139.09 3149.47 3151.83 3170.61 3311.85 3392.93 3484.06 3611.22 3677.86 3785.70 3837.47
formula: C10H18N3O6S
InChI: InChI=1S/C10H18N3O6S/c11-5(10(18)19)1-2-7(14)13-6(4-20)9(17)12-3-8(15)16/h5-6,12-13,15,18,20H,1-4H2,11H3
38 atoms
N  -1.258793 -1.112165 -2.327939
H  -1.302384 -0.113887 -2.214222
C  -1.572669 -1.694691 -3.606366
H  -2.347896 -2.45774 -3.485687
C  -0.385357 -2.348115 -4.302108
O  0.757281 -2.241014 -3.935214
C  -0.918936 -1.872995 -1.267354
C  -0.858446 -1.160554 0.090401
O  -0.702476 -3.076752 -1.373814
N  0.036634 -0.021258 0.061697
H  -0.524713 -1.913728 0.806296
C  -2.267128 -0.724902 0.497313
H  -0.339493 0.87613 0.334677
H  -2.649623 0.025785 -0.196339
H  -2.92356 -1.594338 0.468758
O  -0.676968 -3.080975 -5.374038
H  -1.621805 -3.103475 -5.564016
H  -1.969415 -0.917434 -4.262394
S  -2.190536 -0.04147 2.175738
H  -3.484773 0.283817 2.259328
C  1.410704 -0.083578 0.123648
O  2.081789 0.91576 0.232928
C  2.065046 -1.450874 -0.009898
H  2.808612 -1.51564 0.785131
H  1.355665 -2.265244 0.137358
C  2.753546 -1.54538 -1.376412
H  3.639998 -0.912799 -1.375953
H  2.099788 -1.180346 -2.170489
C  3.172954 -2.966409 -1.74213
H  3.808009 -2.943797 -2.630096
N  1.988461 -3.81993 -2.080428
H  1.156244 -3.602459 -1.510981
H  1.693943 -3.635463 -3.045379
C  3.933754 -3.707507 -0.650067
O  3.617037 -4.805198 -0.272795
O  4.968401 -3.004013 -0.210985
H  5.443404 -3.52052 0.45629
H  2.223862 -4.802732 -1.923326
totalener: -1406.23500083 hartree
nucrepener: 1860.18424109 hartree
electener: -3266.41924192 hartree
oneelecener: -5603.39747886 hartree
twoeener: 2336.97823694 hartree
kineticenergy: 1400.65384981 hartree
exchangeener: -105.323611937577 hartree
correlationener: -7.051892662490 hartree
xcener: -112.375504600067 hartree
temp: 298.15 k
press: 1.00 atm
thermalcorrenthalpy: 0.00094421 hartree
totalenthalpy: -1405.98554821 hartree
totalentropycorr: -0.06657160 hartree
gibbsenthalpy: -1406.05211981 hartree
gibbsminuselec: 0.26319339 hartree
chargesum: 1.0000000
charge: -0.164373 0.194404 -0.155484 0.137282 0.365294 -0.373984 0.209020 0.066471 -0.422029 -0.232546 0.145024 -0.210846 0.194790 0.114054 0.134781 -0.204878 0.230288 0.163766 -0.119539 0.120018 0.174539 -0.303325 -0.170707 0.149565 0.069720 -0.220526 0.162747 0.136000 0.001956 0.148810 -0.060469 0.242891 0.235826 0.298996 -0.299457 -0.240719 0.255117 0.227521
charge: 0.345655 -0.013820 -0.049592 0.039681 -0.421710 0.123623 -0.364073 -0.164970 0.077263 0.310427 0.036513 -0.232251 -0.018234 -0.000469 0.014215 0.410580 -0.083006 0.043674 0.492800 -0.140574 -0.376454 0.119320 -0.006932 0.040576 0.011254 0.000404 0.047967 0.030700 -0.046950 0.051109 0.616222 0.019077 0.012468 -0.440310 0.133199 0.406820 -0.064060 0.039862
qa: -0.1644 0.1944 -0.1555 0.1373 0.3653 -0.3740 0.2090 0.0665 -0.4220 -0.2325 0.1450 -0.2108 0.1948 0.1141 0.1348 -0.2049 0.2303 0.1638 -0.1195 0.1200 0.1745 -0.3033 -0.1707 0.1496 0.0697 -0.2205 0.1627 0.1360 0.0020 0.1488 -0.0605 0.2429 0.2358 0.2990 -0.2995 -0.2407 0.2551 0.2275
va: 3.1647 1.0139 3.8425 1.0045 4.1981 2.0929 4.1387 3.7269 2.0827 3.0298 1.0106 4.0948 1.0280 1.0000 1.0010 2.2909 1.0151 0.9896 2.1795 1.0208 4.3674 2.2257 3.7361 1.0324 1.0370 3.8274 1.0168 1.0299 3.8633 1.0057 3.6456 1.0300 1.0163 4.3493 2.1912 2.2774 1.0044 0.9976
dispcorr: -0.081269583 hartree
energy: -1406.322052057544
dipole: -3.96135 2.78806 -1.17329 -0.68984 -0.67917 -1.36901 -3.44022 1.15492 -2.28530
magnitude: 2.91091 au
magnitude: 7.39894 debye
zeropoint: 0.31038649 hartree
thermalvibcorrection: 0.01914724 hartree
thermalrotcorrection: 0.00141627 hartree
thermaltrasncorrection: 0.00141627 hartree
thermaltotal: -1405.98968579 hartree
thermalcorr: 0.02197978 hartree
nonthermalcorr: 0.31038649 hartree
totalcorr: 0.33236627 hartree
totalenthalpy: -1405.98874158 hartree
