program: Orca
programVersion: 5.0.2
elementType: N H C H C O C C O N H C H H H O H H S H C O C H H C H H C H N H H C O O H H
charge: 1
multiplicity: 1
keywords: wB97X-D3BJ Opt Freq def2-TZVPP def2/J RIJCOSX VeryTightSCF
keywords: PAL8 defgrid3 TightOpt
frequency: 0.00 0.00 0.00 0.00 0.00 0.00 41.93 45.61 61.03 75.96 78.42 97.47 108.63 110.58 122.23 145.78 152.68 161.97 183.84 192.74 216.06 237.20 247.97 259.26 300.66 313.22 330.39 355.95 363.38 427.00 444.49 466.28 507.06 514.76 535.26 549.90 560.60 580.39 620.71 651.80 657.31 682.01 703.82 728.07 736.78 753.28 772.20 796.50 828.08 857.22 871.08 905.01 911.26 933.71 941.03 950.23 1016.31 1047.55 1071.91 1086.98 1121.23 1132.10 1154.60 1157.34 1172.57 1220.91 1228.83 1240.93 1249.56 1293.22 1306.89 1316.10 1319.72 1339.55 1355.67 1359.35 1362.14 1380.88 1388.85 1425.44 1460.67 1463.61 1467.88 1475.80 1492.47 1494.04 1500.99 1525.76 1577.78 1588.37 1632.23 1676.52 1733.23 1766.38 1797.49 1835.69 2772.92 2894.75 3096.10 3108.49 3114.41 3115.90 3131.14 3135.56 3167.34 3169.93 3172.21 3185.00 3193.74 3553.28 3583.54 3611.74 3725.83 3783.52
frequency: 41.93 45.61 61.03 75.96 78.42 97.47 108.63 110.58 122.23 145.78 152.68 161.97 183.84 192.74 216.06 237.20 247.97 259.26 300.66 313.22 330.39 355.95 363.38 427.00 444.49 466.28 507.06 514.76 535.26 549.90 560.60 580.39 620.71 651.80 657.31 682.01 703.82 728.07 736.78 753.28 772.20 796.50 828.08 857.22 871.08 905.01 911.26 933.71 941.03 950.23 1016.31 1047.55 1071.91 1086.98 1121.23 1132.10 1154.60 1157.34 1172.57 1220.91 1228.83 1240.93 1249.56 1293.22 1306.89 1316.10 1319.72 1339.55 1355.67 1359.35 1362.14 1380.88 1388.85 1425.44 1460.67 1463.61 1467.88 1475.80 1492.47 1494.04 1500.99 1525.76 1577.78 1588.37 1632.23 1676.52 1733.23 1766.38 1797.49 1835.69 2772.92 2894.75 3096.10 3108.49 3114.41 3115.90 3131.14 3135.56 3167.34 3169.93 3172.21 3185.00 3193.74 3553.28 3583.54 3611.74 3725.83 3783.52
formula: C10H18N3O6S
InChI: InChI=1S/C10H18N3O6S/c11-5(10(18)19)1-2-7(14)13-6(4-20)9(17)12-3-8(15)16/h5-6,12-13,15,18,20H,1-4H2,11H3
38 atoms
N  -1.218845 -0.838648 -2.809037
H  -1.822083 -0.053003 -2.621491
C  -0.683224 -1.040173 -4.133649
H  -0.766218 -2.081026 -4.443502
C  0.782714 -0.634781 -4.18003
O  1.275523 0.158606 -3.402113
C  -0.656659 -1.524841 -1.791175
C  -0.908167 -1.066209 -0.343276
O  0.123089 -2.442504 -1.992359
N  0.010302 0.027252 -0.031338
H  -0.65856 -1.934373 0.266518
C  -2.341941 -0.669592 0.010722
H  -0.372451 0.963787 -0.062918
H  -2.4301 -0.617968 1.095008
H  -3.017705 -1.437759 -0.362515
O  1.454426 -1.228489 -5.149529
H  2.386952 -0.959894 -5.107518
H  -1.232289 -0.425032 -4.84795
S  -2.797649 0.949568 -0.69081
H  -4.069509 0.945476 -0.281963
C  1.356652 0.018979 -0.000254
O  1.963817 1.097153 0.011039
C  2.133656 -1.281536 0.080311
H  2.809526 -1.156504 0.929828
H  1.475727 -2.12119 0.293295
C  2.928111 -1.661207 -1.179495
H  2.238792 -1.81102 -2.006963
H  3.390346 -2.630387 -0.985056
C  4.06873 -0.738423 -1.637092
H  4.836275 -0.641259 -0.868852
N  3.581134 0.622632 -1.987845
H  2.864711 0.549142 -2.734611
H  3.095002 1.026901 -1.144885
C  4.653513 -1.347787 -2.904348
O  4.315561 -1.005521 -4.011002
O  5.520639 -2.312969 -2.635926
H  5.823244 -2.710888 -3.465385
H  4.3347 1.227033 -2.304697
totalener: -1406.25172931 hartree
nucrepener: 1945.60991830 hartree
electener: -3351.86164760 hartree
oneelecener: -5774.97021081 hartree
twoeener: 2423.10856321 hartree
kineticenergy: 1400.68100319 hartree
exchangeener: -105.336893847572 hartree
correlationener: -7.061855058318 hartree
xcener: -112.398748905889 hartree
temp: 298.15 k
press: 1.00 atm
thermalcorrenthalpy: 0.00094421 hartree
totalenthalpy: -1406.00716424 hartree
totalentropycorr: -0.06403335 hartree
gibbsenthalpy: -1406.07119758 hartree
gibbsminuselec: 0.26518279 hartree
chargesum: 1.0000000
charge: -0.166813 0.178740 -0.069457 0.145884 0.352323 -0.404379 0.219837 0.012926 -0.382915 -0.135723 0.146684 -0.195012 0.178477 0.147284 0.138297 -0.238935 0.255498 0.137282 -0.155940 0.131486 0.228118 -0.392887 -0.152079 0.139624 0.120786 -0.280082 0.139277 0.148575 0.034547 0.160114 -0.075327 0.222269 0.221537 0.307099 -0.354616 -0.232194 0.253219 0.216480
charge: 0.336317 -0.064705 -0.030185 0.042183 -0.416683 0.118044 -0.379897 -0.131852 0.098618 0.349168 0.043648 -0.210048 -0.019786 0.012792 0.015795 0.405784 -0.084088 0.042505 0.501705 -0.133982 -0.343415 0.108280 0.004676 0.043047 0.034126 0.003492 0.022814 0.046168 -0.056299 0.043765 0.603309 -0.021056 -0.043541 -0.431415 0.111850 0.406784 -0.064265 0.036347
qa: -0.1668 0.1787 -0.0695 0.1459 0.3523 -0.4044 0.2198 0.0129 -0.3829 -0.1357 0.1467 -0.1950 0.1785 0.1473 0.1383 -0.2389 0.2555 0.1373 -0.1559 0.1315 0.2281 -0.3929 -0.1521 0.1396 0.1208 -0.2801 0.1393 0.1486 0.0345 0.1601 -0.0753 0.2223 0.2215 0.3071 -0.3546 -0.2322 0.2532 0.2165
va: 3.1681 1.0615 3.8548 1.0144 4.1944 2.0961 4.1804 3.9096 2.1204 3.1777 0.9967 3.9844 1.0454 0.9949 0.9968 2.2806 1.0200 1.0006 2.1937 1.0157 4.2272 2.0975 3.8630 1.0102 1.0217 3.8942 1.0217 1.0146 3.8280 1.0069 3.5531 1.0744 1.0843 4.3213 2.1238 2.2910 1.0062 0.9842
dispcorr: -0.084393685 hartree
energy: -1406.342761663354
dipole: -0.29887 1.25874 0.95987 -2.26513 2.31031 0.04518 5.13240 -4.97537 0.15704
magnitude: 0.97368 au
magnitude: 2.47490 debye
zeropoint: 0.31174839 hartree
thermalvibcorrection: 0.01787835 hartree
thermalrotcorrection: 0.00141627 hartree
thermaltrasncorrection: 0.00141627 hartree
thermaltotal: -1406.01030238 hartree
thermalcorr: 0.02071089 hartree
nonthermalcorr: 0.31174839 hartree
totalcorr: 0.33245928 hartree
totalenthalpy: -1406.00935817 hartree
