program: Gaussian 09
title: 000047357
version: EM64L-G09RevD.01
frameworkgroup: C1[X(C10H8F3NO)]
method: RPBEPBE
basis: SDD
operation: Freq
keyword: #p
keyword: freq=noraman
keyword: PBEPBE/SDD
title: #p freq=noraman PBEPBE/SDD
converged: YES YES NO NO
title: Mulliken charges:
elementType: F F F O N C C C C C C C C C C H H H H H H H H
charge: -0.163952 -0.164234 -0.164237 -0.270181 -0.630013 0.288082 0.503484 -0.473347 -0.374985 -0.369822 -0.210586 0.255538 -0.244275 -0.343485 0.223051 0.267617 0.270464 0.231924 0.239221 0.273876 0.206256 0.310854 0.338750
chargesum: 0.00000
title: Mulliken charges with hydrogens summed into heavy atoms:
elementType: F F F O N C C C C C C C C C C
charge: -0.163952 -0.164234 -0.164237 -0.270181 0.019592 0.288082 0.503484 -0.205730 -0.104521 -0.137898 0.028634 0.255538 0.029601 -0.137229 0.223051
polarizability: 2.15239417e+02 -8.63021508e+00 1.24753050e+02 -1.32983705e-01 -1.25547884e-01 5.43870772e+01
1716.lowfreq: -29.6202 -9.7054 -1.3495 0.0004 0.0007 0.0009 3.4248 32.6551 70.4004
frequency: -28.4758 32.5162 70.4001 77.6350 123.7761 147.5642 159.3736 226.2466 269.3638 273.9222 304.2676 332.8626 378.5008 429.1341 464.6419 484.2022 487.7954 530.4949 544.4969 562.1661 608.3831 613.8959 639.6748 689.1753 711.8888 713.5914 812.2062 871.3919 874.9016 914.9820 916.7965 929.4942 987.5571 987.6154 995.3494 1009.0872 1013.8023 1046.3841 1055.3209 1109.1004 1189.2387 1203.5126 1234.5363 1292.1348 1303.5329 1324.7296 1356.2037 1393.4503 1429.4277 1486.8719 1577.7258 1596.4335 1614.1455 1624.6238 1664.0981 3100.6860 3111.6295 3140.6039 3145.0468 3159.8475 3179.4034 3521.7508 3677.5531
redmass: 12.3772 4.8167 7.7147 5.6825 6.2195 2.7389 6.9080 8.7216 3.1187 6.8083 5.5830 8.2520 6.4871 4.5967 2.4346 4.3231 1.4361 5.9351 6.1616 1.4921 11.9362 2.9213 5.5643 2.3798 2.9645 7.8297 1.5465 5.2308 1.9179 2.8832 1.5931 1.4333 4.4121 6.0756 1.6423 6.2507 1.1969 2.0238 3.7391 1.7573 1.1026 1.6721 1.4712 2.1908 2.6066 1.2676 3.0319 7.6416 3.3180 2.5856 2.6005 5.9255 5.9177 1.7612 5.6189 1.0918 1.0893 1.0870 1.0928 1.0934 1.0976 1.0448 1.1044
irintensity: 0.4856 7.5655 0.8904 1.6994 0.7601 2.5969 7.1663 1.6742 1.3000 4.4794 0.0497 7.5628 0.0016 0.6813 41.4867 2.5112 101.6755 15.0486 22.2206 120.6884 18.5753 37.7425 0.0267 45.8459 0.0075 5.3203 68.1471 30.1099 32.0975 10.5873 8.3641 12.2948 157.1714 12.9713 49.8810 157.9760 53.7308 3.5330 129.9789 5.0696 11.8277 142.1231 99.8648 41.8813 80.2369 24.2348 203.3340 48.3026 97.4964 5.4953 184.4443 0.7868 2.0410 159.0198 107.3623 0.6962 16.3268 4.2875 1.6364 10.7479 5.6133 64.1432 27.8183
temp: 298.150 k
press: 1.00000 atm
elementType: 9 9 9 8 7 6 6 6 6 6 6 6 6 6 6 1 1 1 1 1 1 1 1
symmnumber: 1
zpe: 423042.3 jmol-1
zpe.correction: 0.161128 hartree
zpe.thermalcorrener: 0.174029 hartree
zpe.thermalcorrenthalpy: 0.174974 hartree
zpe.thermalcorrgfe: 0.120600 hartree
zpe.sumelectzpe: -814.300261 hartree
zpe.sumelectthermal: -814.287360 hartree
zpe.sumelectthermalent: -814.286415 hartree
zpe.sumelectthermalfe: -814.340789 hartree
dipole: 3.4566 6.2150 -0.0263
dipole: 7.1116
quadrupole: -78.2253 -82.4597 -91.0251
quadrupole: 11.4083 -0.1774 0.0003
quadrupole: 5.6781 1.4437 -7.1218 11.4083 -0.1774 0.0003
hfenergy: -814.4613889 hartree
pointgroup: C01 [X(C10H8F3N1O1)]
dipole: -1.3247667 2.4634002 -0.0704661 debye
dipolederiv: -0.8811594 -0.1635174 -0.0177893 -0.081288 -0.4288935 -0.0012897 -0.0190995 -0.0040042 -0.2882061 -0.4657673 0.1192179 -0.0323764 0.2490868 -0.5633886 0.2879325 -0.0882239 0.2529596 -0.6465365 -0.4752746 0.1377576 0.0409486 0.2714149 -0.5785213 -0.2730622 0.0930726 -0.2468005 -0.6237663 -0.7942683 -0.0999936 -0.0104641 -0.1916462 -1.0114073 0.0002935 -0.0089702 0.0034675 -0.3718672 -1.2972325 0.4027837 -0.0193301 0.3099258 -0.4236874 0.0052509 -0.0176851 0.0076169 -0.7259495 -0.2832188 0.1474458 -0.0067445 0.1067945 -0.1652479 0.0038008 -0.0062845 0.005364 -0.1479027 0.154937 0.0634433 0.0022747 -0.0105449 -0.1125297 0.0018303 0.0016304 0.0039488 0.0330148 -0.0781198 -0.0695657 0.0026568 0.0129213 0.0383544 -0.0020177 0.0003634 -0.0051255 -0.1149918 -0.0515701 0.0486293 0.0014457 -0.1701191 -0.016688 -0.0067665 0.0052755 -0.000101 -0.1151239 -0.0321403 -0.0693465 0.0047545 -0.0380466 0.0147622 -0.0037322 0.0049728 -0.0042085 -0.1204601 -0.2063386 -0.005523 -0.0021581 0.0992412 0.1820319 -0.0025022 -0.0043367 -0.0058547 -0.1313128 2.0043584 -0.2529798 0.0178425 -0.5907823 1.564402 -0.0183049 0.0232435 -0.0074062 1.5545577 0.4686182 0.0902334 0.0140691 0.0960441 0.1116573 0.0008096 0.0154873 0.0005203 -0.0737185 -0.9421691 -0.2168817 -0.0180652 -0.1679743 0.0382974 -0.0070239 -0.019112 -0.0087806 -0.2117753 2.099086 -0.1451824 0.0507182 0.202377 1.2076315 -0.0026548 0.0458591 -0.0127422 0.2625469 0.1104041 -0.0297932 -0.0009325 -0.0189359 -0.019243 0.0023141 -0.0011555 0.0020283 0.1523912 0.0141364 -0.0527726 -0.0037908 -0.0488184 0.0933595 -0.000306 -0.0039872 -0.0004965 0.1630225 -0.026778 0.10695 -0.0073407 0.0756798 0.0427292 0.0041286 -0.0066563 0.0049759 0.1415367 0.0705044 -0.0144342 -0.0024841 -0.0333032 -0.0969299 0.0034685 -0.0023116 0.0040261 0.158036 0.1010438 0.0304819 -0.0019614 -0.0070268 -0.0079546 0.0016716 -0.0009878 0.0030971 0.1520207 0.0509131 0.0000879 -0.0031204 -0.0256902 -0.1296434 0.0022306 -0.0027396 0.0030885 0.1686947 0.2414189 -0.0158294 -0.0037911 -0.0593353 0.1017066 0.001205 -0.0034997 0.0024797 0.3967066 0.2186167 -0.0112112 -0.0043615 0.0200258 0.1592025 0.0027242 -0.0048549 0.0019472 0.389083 unknown
polarizability: 215.330126|7.4116234|124.5181615|4.5605562|-0.8237034|54.5312565 unknown
InChI: InChI=1S/C10H8F3NO/c11-10(12,13)8-3-1-2-7(6-8)4-5-9(14)15/h1-6H,14H2
charge 0 multiplicity 1
23 atoms
F  4.394477 -0.01889 0.130689
F  3.170413 -1.574254 1.241319
F  3.248596 -1.60548 -1.01842
O  -4.236967 -1.792035 -0.116111
N  -5.451783 0.187679 -0.166952
C  1.969929 0.171255 0.04473
C  -0.48015 0.392008 -0.035474
C  0.685799 -0.417141 0.014324
C  2.12078 1.574881 0.025427
C  -0.316158 1.808923 -0.05482
C  0.965269 2.38853 -0.024845
C  3.173567 -0.727569 0.098363
C  -1.793095 -0.271025 -0.064368
C  -3.021597 0.321592 -0.104404
C  -4.256731 -0.522058 -0.128909
H  0.582907 -1.508204 0.029708
H  3.118937 2.020807 0.049402
H  -1.196272 2.459537 -0.093992
H  1.07326 3.477755 -0.040431
H  -1.797333 -1.371127 -0.051867
H  -3.141095 1.413201 -0.118707
H  -5.485974 1.205287 -0.177524
H  -6.324279 -0.339373 -0.185039
