program: Orca
programVersion: 5.0.2
elementType: N H C H C O C C O N H C H H H O H H S H C O C H H C H H C H N H H C O O H H
charge: 1
multiplicity: 1
keywords: wB97X-D3BJ Opt Freq def2-TZVPP def2/J RIJCOSX VeryTightSCF
keywords: PAL8 defgrid3 TightOpt
frequency: 0.00 0.00 0.00 0.00 0.00 0.00 18.92 31.40 38.69 48.13 49.67 68.90 76.95 84.90 105.86 125.75 141.86 145.30 196.63 207.68 249.52 258.77 266.54 280.27 286.29 306.13 332.39 344.05 346.12 384.36 463.35 472.33 495.28 506.85 511.73 534.39 537.27 576.92 615.62 622.35 648.29 670.61 679.90 698.43 730.87 743.61 750.03 787.96 792.99 836.65 859.44 860.24 900.19 914.27 952.22 975.10 989.79 1026.05 1066.38 1072.99 1098.81 1104.01 1112.59 1182.98 1197.25 1205.66 1216.62 1227.02 1243.10 1263.89 1271.89 1298.56 1306.14 1341.78 1357.57 1362.23 1368.91 1382.77 1392.10 1397.50 1418.18 1459.71 1461.46 1476.49 1478.00 1505.13 1509.45 1512.33 1525.55 1585.32 1639.26 1672.53 1759.06 1791.20 1840.74 1883.04 2739.68 3080.54 3094.21 3099.00 3111.66 3113.23 3123.94 3136.37 3160.53 3166.11 3176.72 3219.20 3307.48 3557.58 3561.69 3685.71 3793.53 3800.02
frequency: 18.92 31.40 38.69 48.13 49.67 68.90 76.95 84.90 105.86 125.75 141.86 145.30 196.63 207.68 249.52 258.77 266.54 280.27 286.29 306.13 332.39 344.05 346.12 384.36 463.35 472.33 495.28 506.85 511.73 534.39 537.27 576.92 615.62 622.35 648.29 670.61 679.90 698.43 730.87 743.61 750.03 787.96 792.99 836.65 859.44 860.24 900.19 914.27 952.22 975.10 989.79 1026.05 1066.38 1072.99 1098.81 1104.01 1112.59 1182.98 1197.25 1205.66 1216.62 1227.02 1243.10 1263.89 1271.89 1298.56 1306.14 1341.78 1357.57 1362.23 1368.91 1382.77 1392.10 1397.50 1418.18 1459.71 1461.46 1476.49 1478.00 1505.13 1509.45 1512.33 1525.55 1585.32 1639.26 1672.53 1759.06 1791.20 1840.74 1883.04 2739.68 3080.54 3094.21 3099.00 3111.66 3113.23 3123.94 3136.37 3160.53 3166.11 3176.72 3219.20 3307.48 3557.58 3561.69 3685.71 3793.53 3800.02
formula: C10H18N3O6S
InChI: InChI=1S/C10H18N3O6S/c11-5(10(18)19)1-2-7(14)13-6(4-20)9(17)12-3-8(15)16/h5-6,12-13,15,18,20H,1-4H2,11H3
38 atoms
N  -3.373414 -1.223577 0.134323
H  -3.197889 -2.158779 -0.188407
C  -4.724825 -0.848936 0.489118
H  -4.892274 0.200675 0.251605
C  -5.07568 -1.031411 1.958682
O  -6.108793 -0.661675 2.432605
C  -2.33727 -0.442525 0.496164
C  -0.940643 -1.063825 0.35847
O  -2.46464 0.670456 0.973105
N  -0.050287 0.047523 0.116288
H  -0.925422 -1.767538 -0.478769
C  -0.695325 -1.863088 1.67068
H  -0.479284 0.951889 0.27809
H  -1.644661 -2.267311 2.021333
H  -0.035352 -2.712363 1.498899
O  -4.115494 -1.670145 2.665631
H  -4.443058 -1.736076 3.572952
H  -5.431103 -1.438755 -0.094719
S  0.060719 -0.918552 3.012977
H  -0.724854 0.163983 2.930118
C  1.297395 0.061207 0.11351
O  1.921382 1.11261 0.184305
C  2.042397 -1.257944 0.032325
H  1.737778 -1.901362 0.859438
H  1.74276 -1.784606 -0.876988
C  3.559694 -1.078924 0.023259
H  3.873577 -0.628444 -0.917066
H  4.016249 -2.068723 0.067266
C  4.16405 -0.210491 1.138066
H  5.149332 -0.607342 1.396353
N  3.384446 -0.169124 2.423289
H  2.366196 -0.280888 2.306437
H  3.701309 -0.854935 3.103721
C  4.409011 1.268616 0.822115
O  4.288087 2.108018 1.679065
O  4.878235 1.464207 -0.39494
H  5.046634 2.409334 -0.51757
H  3.545079 0.792056 2.782937
totalener: -1406.22610532 hartree
nucrepener: 1836.50909329 hartree
electener: -3242.73519861 hartree
oneelecener: -5557.14829894 hartree
twoeener: 2314.41310033 hartree
kineticenergy: 1400.64505309 hartree
exchangeener: -105.320181018065 hartree
correlationener: -7.056261548633 hartree
xcener: -112.376442566698 hartree
temp: 298.15 k
press: 1.00 atm
thermalcorrenthalpy: 0.00094421 hartree
totalenthalpy: -1405.97833921 hartree
totalentropycorr: -0.06571725 hartree
gibbsenthalpy: -1406.04405646 hartree
gibbsminuselec: 0.26359131 hartree
chargesum: 1.0000000
charge: -0.199120 0.180143 -0.075272 0.145869 0.292418 -0.272671 0.260969 -0.021753 -0.374449 -0.160211 0.118958 -0.160680 0.202896 0.142626 0.134348 -0.286119 0.233105 0.133986 -0.160811 0.150948 0.189633 -0.353055 -0.204405 0.099401 0.140157 -0.161296 0.135330 0.126100 -0.072496 0.147063 -0.020971 0.170564 0.228680 0.360874 -0.312035 -0.242870 0.254706 0.229442
charge: 0.335769 -0.020612 -0.030929 0.047311 -0.431475 0.143916 -0.389385 -0.132989 0.101415 0.337518 0.030455 -0.235630 -0.008588 0.011126 0.000116 0.342069 -0.084819 0.040571 0.523710 -0.126430 -0.402567 0.098878 -0.019031 0.018576 0.043899 0.006537 0.044984 0.032074 -0.041654 0.045940 0.610864 -0.007535 0.041950 -0.446841 0.141963 0.410925 -0.061613 0.029534
qa: -0.1991 0.1801 -0.0753 0.1459 0.2924 -0.2727 0.2610 -0.0218 -0.3744 -0.1602 0.1190 -0.1607 0.2029 0.1426 0.1343 -0.2861 0.2331 0.1340 -0.1608 0.1509 0.1896 -0.3531 -0.2044 0.0994 0.1402 -0.1613 0.1353 0.1261 -0.0725 0.1471 -0.0210 0.1706 0.2287 0.3609 -0.3120 -0.2429 0.2547 0.2294
va: 3.2263 1.0122 3.8155 1.0174 4.2843 2.2392 4.2506 3.9551 2.1377 3.1641 1.0045 3.8471 1.0339 1.0309 0.9904 2.1462 1.0221 1.0015 2.2540 1.0262 4.2571 2.1244 3.8316 1.0085 1.0046 3.8577 1.0243 1.0008 3.9830 0.9983 3.5714 1.1338 0.9734 4.3229 2.1916 2.2828 1.0062 1.0275
dispcorr: -0.082199356 hartree
energy: -1406.313748838766
dipole: 8.48632 -4.72442 3.76190 -9.51604 6.91508 -2.60096 -2.78102 2.59326 -0.18776
magnitude: 4.57735 au
magnitude: 11.63470 debye
zeropoint: 0.31088613 hartree
thermalvibcorrection: 0.01847225 hartree
thermalrotcorrection: 0.00141627 hartree
thermaltrasncorrection: 0.00141627 hartree
thermaltotal: -1405.98155792 hartree
thermalcorr: 0.02130479 hartree
nonthermalcorr: 0.31088613 hartree
totalcorr: 0.33219092 hartree
totalenthalpy: -1405.98061371 hartree
