program: Orca
programVersion: 5.0.2
elementType: N H C H C O C C O N H C H H H O H H S H C O C H H C H H C H N H H C O O H H
charge: 1
multiplicity: 1
keywords: wB97X-D3BJ Opt Freq def2-TZVPP def2/J RIJCOSX VeryTightSCF
keywords: PAL8 defgrid3 TightOpt
frequency: 0.00 0.00 0.00 0.00 0.00 0.00 39.64 42.17 58.90 63.30 79.79 93.26 97.73 112.42 120.87 145.89 171.57 189.04 201.17 207.76 237.80 249.39 252.63 268.69 306.24 326.82 332.01 360.83 368.40 391.46 435.29 460.90 498.88 512.27 532.04 589.82 592.45 610.19 618.12 643.94 661.65 695.04 723.35 731.52 746.09 774.29 794.72 833.63 856.62 866.76 881.22 894.41 921.62 930.98 955.28 985.51 1016.36 1033.24 1047.32 1077.55 1112.86 1128.11 1162.94 1173.63 1185.44 1215.36 1231.74 1249.74 1259.58 1294.49 1312.90 1323.35 1329.82 1335.24 1348.98 1377.16 1388.06 1394.68 1401.69 1436.26 1461.06 1468.73 1472.77 1478.10 1482.78 1489.86 1491.61 1509.85 1531.29 1605.35 1646.52 1691.47 1719.72 1747.61 1847.58 1871.01 2763.84 3097.62 3101.97 3103.47 3108.30 3111.29 3113.96 3115.79 3153.65 3159.15 3162.13 3200.33 3289.17 3366.72 3423.05 3525.44 3617.56 3787.55
frequency: 39.64 42.17 58.90 63.30 79.79 93.26 97.73 112.42 120.87 145.89 171.57 189.04 201.17 207.76 237.80 249.39 252.63 268.69 306.24 326.82 332.01 360.83 368.40 391.46 435.29 460.90 498.88 512.27 532.04 589.82 592.45 610.19 618.12 643.94 661.65 695.04 723.35 731.52 746.09 774.29 794.72 833.63 856.62 866.76 881.22 894.41 921.62 930.98 955.28 985.51 1016.36 1033.24 1047.32 1077.55 1112.86 1128.11 1162.94 1173.63 1185.44 1215.36 1231.74 1249.74 1259.58 1294.49 1312.90 1323.35 1329.82 1335.24 1348.98 1377.16 1388.06 1394.68 1401.69 1436.26 1461.06 1468.73 1472.77 1478.10 1482.78 1489.86 1491.61 1509.85 1531.29 1605.35 1646.52 1691.47 1719.72 1747.61 1847.58 1871.01 2763.84 3097.62 3101.97 3103.47 3108.30 3111.29 3113.96 3115.79 3153.65 3159.15 3162.13 3200.33 3289.17 3366.72 3423.05 3525.44 3617.56 3787.55
formula: C10H18N3O6S
InChI: InChI=1S/C10H18N3O6S/c11-5(10(18)19)1-2-7(14)13-6(4-20)9(17)12-3-8(15)16/h5-6,12-13,15,18,20H,1-4H2,11H3
38 atoms
N  0.006002 -2.527643 2.352964
H  -0.014555 -3.258435 1.651452
C  0.702098 -2.770368 3.613904
H  0.134828 -2.335563 4.43789
C  2.105409 -2.160304 3.536797
O  3.106712 -2.798888 3.372804
C  -0.377723 -1.289263 2.014005
C  -0.904848 -1.005934 0.59944
O  -0.262778 -0.331749 2.779422
N  -0.008728 -0.021946 -0.027311
H  -1.812677 -0.432392 0.797209
C  -1.393937 -2.16006 -0.28057
H  -0.367304 0.921427 0.015738
H  -2.239994 -2.617707 0.232235
H  -1.756263 -1.724936 -1.210686
O  2.142924 -0.812847 3.581226
H  1.218909 -0.458071 3.545195
H  0.80232 -3.841652 3.76187
S  -0.204694 -3.48509 -0.67085
H  -1.122778 -4.401815 -0.993563
C  1.355359 0.007511 -0.014399
O  1.932854 1.091942 -0.013984
C  2.135931 -1.290489 -0.097412
H  1.907383 -1.93806 0.750213
H  1.769052 -1.815745 -0.980187
C  3.64754 -1.101355 -0.246934
H  3.849836 -0.315699 -0.977847
H  4.069669 -2.025202 -0.641539
C  4.399115 -0.807238 1.052333
H  4.240331 -1.610947 1.775397
N  3.957444 0.473623 1.69062
H  3.302185 0.969691 1.050683
H  3.466026 0.27693 2.568361
C  5.901844 -0.665789 0.835208
O  6.512819 0.314758 1.173974
O  6.424773 -1.737289 0.256417
H  7.379524 -1.608785 0.159989
H  4.797708 1.040315 1.862291
totalener: -1406.23760090 hartree
nucrepener: 1933.60128998 hartree
electener: -3339.83889088 hartree
oneelecener: -5749.66618761 hartree
twoeener: 2409.82729672 hartree
kineticenergy: 1400.66152690 hartree
exchangeener: -105.325504987561 hartree
correlationener: -7.062170457542 hartree
xcener: -112.387675445103 hartree
temp: 298.15 k
press: 1.00 atm
thermalcorrenthalpy: 0.00094421 hartree
totalenthalpy: -1405.99335022 hartree
totalentropycorr: -0.06409183 hartree
gibbsenthalpy: -1406.05744205 hartree
gibbsminuselec: 0.26505951 hartree
chargesum: 1.0000000
charge: -0.171036 0.193306 -0.114758 0.160419 0.303998 -0.291434 0.190588 0.012705 -0.385747 -0.171232 0.145419 -0.176115 0.193804 0.149224 0.141029 -0.328526 0.252247 0.144875 -0.162514 0.140027 0.263022 -0.368970 -0.193998 0.090211 0.154692 -0.223734 0.142158 0.138724 0.009878 0.145032 -0.065959 0.229634 0.233363 0.291444 -0.301614 -0.245507 0.252750 0.222595
charge: 0.342196 -0.065290 -0.021033 0.037653 -0.442454 0.136042 -0.371535 -0.127474 0.126419 0.333557 0.059402 -0.218302 -0.001242 0.016806 0.015080 0.354479 -0.160489 0.041215 0.518846 -0.134525 -0.350583 0.113787 -0.019316 0.024114 0.030865 0.004307 0.039053 0.043878 -0.046702 0.039619 0.612605 -0.015827 0.008189 -0.427314 0.139484 0.403190 -0.063963 0.025266
qa: -0.1710 0.1933 -0.1148 0.1604 0.3040 -0.2914 0.1906 0.0127 -0.3857 -0.1712 0.1454 -0.1761 0.1938 0.1492 0.1410 -0.3285 0.2522 0.1449 -0.1625 0.1400 0.2630 -0.3690 -0.1940 0.0902 0.1547 -0.2237 0.1422 0.1387 0.0099 0.1450 -0.0660 0.2296 0.2334 0.2914 -0.3016 -0.2455 0.2528 0.2226
va: 3.1630 1.0655 3.8567 0.9974 4.1546 2.1982 4.2254 3.9184 2.1327 3.1840 0.9998 3.9307 1.0142 0.9937 1.0055 2.1258 1.0634 1.0087 2.1948 1.0136 4.2171 2.1149 3.7405 1.0393 1.0156 3.9097 1.0101 1.0179 3.8022 1.0693 3.5605 1.0614 1.0239 4.3626 2.1932 2.2667 1.0072 1.0181
dispcorr: -0.084986605 hartree
energy: -1406.328558783372
dipole: -5.30528 4.51088 -0.79439 -1.93713 1.35736 -0.57977 -3.08031 2.52740 -0.55291
magnitude: 1.12823 au
magnitude: 2.86774 debye
zeropoint: 0.31214813 hartree
thermalvibcorrection: 0.01765265 hartree
thermalrotcorrection: 0.00141627 hartree
thermaltrasncorrection: 0.00141627 hartree
thermaltotal: -1405.99592545 hartree
thermalcorr: 0.02048520 hartree
nonthermalcorr: 0.31214813 hartree
totalcorr: 0.33263333 hartree
totalenthalpy: -1405.99498124 hartree
