program: Orca
programVersion: 5.0.2
elementType: N H C H C O C C O N H C H H H O H H S H C O C H H C H H C H N H H C O O H H
charge: 1
multiplicity: 1
keywords: wB97X-D3BJ Opt Freq def2-TZVPP def2/J RIJCOSX VeryTightSCF
keywords: PAL8 defgrid3 TightOpt
frequency: 0.00 0.00 0.00 0.00 0.00 0.00 18.11 26.77 40.73 50.95 62.66 67.97 76.17 83.11 94.33 120.00 132.94 134.85 188.42 192.70 212.05 235.85 258.80 260.52 281.05 296.06 300.13 320.91 337.61 361.14 419.05 427.42 503.97 508.53 518.58 528.16 564.60 603.13 630.62 641.74 649.52 659.12 669.85 684.18 713.68 755.37 758.01 795.45 803.16 849.57 855.08 896.07 921.23 958.34 966.06 1008.64 1026.47 1028.43 1072.52 1085.34 1107.10 1133.43 1142.29 1168.92 1177.46 1207.40 1213.16 1249.01 1250.26 1257.00 1261.87 1278.98 1298.82 1320.44 1327.07 1331.08 1356.03 1370.35 1400.87 1434.15 1459.55 1465.52 1466.71 1479.74 1496.42 1497.13 1503.74 1518.27 1545.76 1596.39 1652.64 1676.84 1729.31 1809.52 1843.97 1852.81 2757.76 3014.06 3094.59 3095.48 3102.69 3109.04 3121.22 3126.72 3135.59 3173.61 3178.38 3192.44 3355.06 3536.27 3601.53 3635.17 3785.09 3795.46
frequency: 18.11 26.77 40.73 50.95 62.66 67.97 76.17 83.11 94.33 120.00 132.94 134.85 188.42 192.70 212.05 235.85 258.80 260.52 281.05 296.06 300.13 320.91 337.61 361.14 419.05 427.42 503.97 508.53 518.58 528.16 564.60 603.13 630.62 641.74 649.52 659.12 669.85 684.18 713.68 755.37 758.01 795.45 803.16 849.57 855.08 896.07 921.23 958.34 966.06 1008.64 1026.47 1028.43 1072.52 1085.34 1107.10 1133.43 1142.29 1168.92 1177.46 1207.40 1213.16 1249.01 1250.26 1257.00 1261.87 1278.98 1298.82 1320.44 1327.07 1331.08 1356.03 1370.35 1400.87 1434.15 1459.55 1465.52 1466.71 1479.74 1496.42 1497.13 1503.74 1518.27 1545.76 1596.39 1652.64 1676.84 1729.31 1809.52 1843.97 1852.81 2757.76 3014.06 3094.59 3095.48 3102.69 3109.04 3121.22 3126.72 3135.59 3173.61 3178.38 3192.44 3355.06 3536.27 3601.53 3635.17 3785.09 3795.46
formula: C10H18N3O6S
InChI: InChI=1S/C10H18N3O6S/c11-5(10(18)19)1-2-7(14)13-6(4-20)9(17)12-3-8(15)16/h5-6,12-13,15,18,20H,1-4H2,11H3
38 atoms
N  -2.023165 -1.842132 2.354472
H  -2.903838 -1.645221 1.898324
C  -2.131286 -2.325326 3.714028
H  -1.650922 -3.298805 3.833709
C  -3.6050 -2.452324 4.042738
O  -4.482502 -2.183819 3.264713
C  -0.854866 -1.573477 1.772468
C  -0.948814 -1.072852 0.323347
O  0.218705 -1.725611 2.360418
N  0.001275 -0.017488 0.037551
H  -1.921906 -0.589153 0.226739
C  -0.955303 -2.240821 -0.708212
H  -0.359918 0.92308 0.088268
H  -1.944795 -2.330621 -1.151086
H  -0.274374 -1.990616 -1.51986
O  -3.790883 -2.894903 5.283871
H  -4.742004 -2.953232 5.451556
H  -1.657078 -1.638747 4.41843
S  -0.465486 -3.899382 -0.160526
H  -1.568309 -4.198491 0.534717
C  1.375375 -0.027792 0.048318
O  1.99883 1.010488 0.059791
C  2.103608 -1.355386 0.008686
H  1.414222 -2.187478 0.111386
H  2.575755 -1.436896 -0.973412
C  3.16892 -1.389756 1.111249
H  2.817099 -0.845767 1.990764
H  4.081953 -0.899716 0.780449
C  3.489109 -2.823708 1.518726
H  3.811778 -3.411543 0.657126
N  2.273685 -3.478004 2.111489
H  2.559174 -3.871029 3.018986
H  1.500959 -2.786456 2.256928
C  4.569456 -2.918814 2.591442
O  4.370677 -3.445263 3.657041
O  5.707391 -2.372171 2.19786
H  6.364282 -2.456147 2.904439
H  1.890309 -4.209457 1.516246
totalener: -1406.23599710 hartree
nucrepener: 1833.70789042 hartree
electener: -3239.94388751 hartree
oneelecener: -5550.72687857 hartree
twoeener: 2310.78299105 hartree
kineticenergy: 1400.65562637 hartree
exchangeener: -105.323986918980 hartree
correlationener: -7.053531937999 hartree
xcener: -112.377518856979 hartree
temp: 298.15 k
press: 1.00 atm
thermalcorrenthalpy: 0.00094421 hartree
totalenthalpy: -1405.98657789 hartree
totalentropycorr: -0.06635713 hartree
gibbsenthalpy: -1406.05293502 hartree
gibbsminuselec: 0.26308949 hartree
chargesum: 1.0000000
charge: -0.148761 0.190145 -0.073630 0.119365 0.303620 -0.315813 0.241595 0.098769 -0.464515 -0.216263 0.119667 -0.191099 0.185605 0.157662 0.145099 -0.250925 0.248981 0.144504 -0.158170 0.116404 0.206654 -0.313891 -0.105614 -0.014387 0.141049 -0.228222 0.132511 0.147270 0.029827 0.147029 -0.067077 0.220638 0.220042 0.298101 -0.305035 -0.237137 0.256657 0.219347
charge: 0.352134 -0.016506 -0.027968 0.033567 -0.435394 0.121189 -0.372355 -0.137986 0.103932 0.324131 0.040854 -0.223746 -0.009312 0.012635 0.018076 0.386847 -0.071865 0.041616 0.493587 -0.147293 -0.379688 0.112839 -0.013388 -0.004528 0.039669 0.002152 0.039794 0.044069 -0.046779 0.045819 0.606309 0.024348 -0.036135 -0.428761 0.137263 0.410026 -0.061616 0.022462
qa: -0.1488 0.1901 -0.0736 0.1194 0.3036 -0.3158 0.2416 0.0988 -0.4645 -0.2163 0.1197 -0.1911 0.1856 0.1577 0.1451 -0.2509 0.2490 0.1445 -0.1582 0.1164 0.2067 -0.3139 -0.1056 -0.0144 0.1410 -0.2282 0.1325 0.1473 0.0298 0.1470 -0.0671 0.2206 0.2200 0.2981 -0.3050 -0.2371 0.2567 0.2193
va: 3.2141 1.0358 3.8599 1.0100 4.3327 2.1745 4.1423 3.8002 2.0329 3.1176 1.0013 3.8661 1.0184 0.9954 1.0120 2.2473 1.0091 1.0066 2.1767 1.0232 4.3580 2.2184 3.7558 1.0934 1.0162 3.8891 1.0216 1.0268 3.8218 1.0050 3.5845 1.0216 1.0971 4.3378 2.1878 2.2820 1.0035 1.0037
dispcorr: -0.080418922 hartree
energy: -1406.321408120478
dipole: 1.87692 -1.59760 0.27932 -2.01804 0.08000 -1.93804 -4.25929 4.58800 0.32871
magnitude: 1.98546 au
magnitude: 5.04665 debye
zeropoint: 0.31061870 hartree
thermalvibcorrection: 0.01878966 hartree
thermalrotcorrection: 0.00141627 hartree
thermaltrasncorrection: 0.00141627 hartree
thermaltotal: -1405.98916721 hartree
thermalcorr: 0.02162220 hartree
nonthermalcorr: 0.31061870 hartree
totalcorr: 0.33224091 hartree
totalenthalpy: -1405.98822300 hartree
