program: Orca
programVersion: 5.0.2
elementType: N H C H C O C C O N H C H H H O H H S H C O C H H C H H C H N H H C O O H H
charge: 1
multiplicity: 1
keywords: wB97X-D3BJ Opt Freq def2-TZVPP def2/J RIJCOSX VeryTightSCF
keywords: PAL8 defgrid3 TightOpt
frequency: 0.00 0.00 0.00 0.00 0.00 0.00 18.95 37.34 50.51 54.46 60.46 74.02 79.76 90.01 109.73 118.09 133.42 138.94 174.66 177.21 191.47 201.13 222.23 247.18 266.32 272.57 289.20 300.50 303.40 326.17 412.12 458.90 501.68 517.04 527.11 531.58 543.64 559.42 570.47 601.00 626.45 640.39 657.71 665.64 703.37 752.81 772.60 790.52 809.82 828.61 851.89 890.58 893.60 947.52 969.82 979.27 1030.00 1032.61 1035.73 1071.99 1087.73 1118.47 1141.71 1157.63 1174.95 1203.24 1205.37 1228.44 1248.71 1254.57 1275.98 1284.19 1300.90 1339.23 1345.82 1351.32 1356.35 1370.15 1384.78 1405.94 1416.65 1460.92 1467.21 1479.44 1489.87 1492.99 1502.24 1508.56 1512.01 1597.07 1653.25 1669.39 1744.76 1774.35 1851.96 1896.89 2755.21 3063.29 3087.59 3091.66 3101.39 3127.57 3131.75 3139.14 3147.49 3152.96 3194.22 3433.54 3515.53 3538.03 3618.19 3646.98 3794.07 3802.30
frequency: 18.95 37.34 50.51 54.46 60.46 74.02 79.76 90.01 109.73 118.09 133.42 138.94 174.66 177.21 191.47 201.13 222.23 247.18 266.32 272.57 289.20 300.50 303.40 326.17 412.12 458.90 501.68 517.04 527.11 531.58 543.64 559.42 570.47 601.00 626.45 640.39 657.71 665.64 703.37 752.81 772.60 790.52 809.82 828.61 851.89 890.58 893.60 947.52 969.82 979.27 1030.00 1032.61 1035.73 1071.99 1087.73 1118.47 1141.71 1157.63 1174.95 1203.24 1205.37 1228.44 1248.71 1254.57 1275.98 1284.19 1300.90 1339.23 1345.82 1351.32 1356.35 1370.15 1384.78 1405.94 1416.65 1460.92 1467.21 1479.44 1489.87 1492.99 1502.24 1508.56 1512.01 1597.07 1653.25 1669.39 1744.76 1774.35 1851.96 1896.89 2755.21 3063.29 3087.59 3091.66 3101.39 3127.57 3131.75 3139.14 3147.49 3152.96 3194.22 3433.54 3515.53 3538.03 3618.19 3646.98 3794.07 3802.30
formula: C10H18N3O6S
InChI: InChI=1S/C10H18N3O6S/c11-5(10(18)19)1-2-7(14)13-6(4-20)9(17)12-3-8(15)16/h5-6,12-13,15,18,20H,1-4H2,11H3
38 atoms
N  -1.656441 -0.795241 -2.640088
H  -2.411922 -0.23455 -2.279395
C  -1.612177 -0.922288 -4.075029
H  -0.655439 -0.574764 -4.470507
C  -2.725256 -0.079538 -4.654945
O  -3.493992 0.567084 -3.992595
C  -0.801605 -1.440524 -1.841882
C  -0.895249 -1.146172 -0.33346
O  0.086815 -2.172419 -2.270838
N  -0.037296 -0.005528 -0.0210
H  -0.507219 -2.031919 0.166376
C  -2.298862 -0.884849 0.203539
H  -0.454235 0.912158 -0.089423
H  -2.242765 -0.688365 1.273482
H  -2.743589 0.004828 -0.24991
O  -2.746036 -0.142408 -5.989031
H  -3.479967 0.403282 -6.302921
H  -1.743104 -1.960165 -4.390586
S  -3.442853 -2.244061 -0.125949
H  -2.943611 -3.088222 0.78409
C  1.319756 0.026443 -0.049751
O  1.936579 1.07921 -0.065596
C  2.08101 -1.291405 -0.039767
H  2.406761 -1.457131 0.989931
H  1.470979 -2.133801 -0.350553
C  3.319382 -1.194636 -0.927133
H  3.888139 -2.124171 -0.820502
H  3.946545 -0.362955 -0.599635
C  2.970381 -1.020055 -2.409035
H  2.220319 -1.740515 -2.736785
N  4.239282 -1.255484 -3.209174
H  4.90929 -0.508788 -3.006145
H  4.657058 -2.152473 -2.960057
C  2.481478 0.38484 -2.77054
O  1.351005 0.65914 -3.030737
O  3.519325 1.240097 -2.792745
H  3.18704 2.141383 -2.909666
H  4.061974 -1.251517 -4.214482
totalener: -1406.21855259 hartree
nucrepener: 1871.78291956 hartree
electener: -3278.00147215 hartree
oneelecener: -5629.26069216 hartree
twoeener: 2351.25922001 hartree
kineticenergy: 1400.63130449 hartree
exchangeener: -105.315281849690 hartree
correlationener: -7.049125460978 hartree
xcener: -112.364407310668 hartree
temp: 298.15 k
press: 1.00 atm
thermalcorrenthalpy: 0.00094421 hartree
totalenthalpy: -1405.96835334 hartree
totalentropycorr: -0.06674879 hartree
gibbsenthalpy: -1406.03510213 hartree
gibbsminuselec: 0.26309431 hartree
chargesum: 1.0000000
charge: -0.135856 0.172435 -0.069644 0.104488 0.303877 -0.321860 0.288825 -0.005180 -0.451574 -0.142283 0.115318 -0.183319 0.179121 0.143587 0.110483 -0.261941 0.242077 0.136114 -0.116359 0.103099 0.161923 -0.349763 -0.180540 0.135485 0.108697 -0.186481 0.098892 0.144144 0.025056 0.199975 -0.056541 0.243483 0.237128 0.233720 -0.241553 -0.289373 0.258850 0.245490
charge: 0.349333 -0.029435 -0.035438 0.030918 -0.429886 0.115981 -0.387034 -0.147388 0.050710 0.337805 0.035116 -0.250490 -0.007874 0.013023 0.006381 0.375751 -0.078664 0.038762 0.503162 -0.146821 -0.384624 0.080819 0.005368 0.043412 0.020117 -0.005916 0.027661 0.036743 -0.030633 0.040563 0.614778 0.056536 0.056543 -0.448392 0.180121 0.366310 -0.064212 0.060894
qa: -0.1359 0.1724 -0.0696 0.1045 0.3039 -0.3219 0.2888 -0.0052 -0.4516 -0.1423 0.1153 -0.1833 0.1791 0.1436 0.1105 -0.2619 0.2421 0.1361 -0.1164 0.1031 0.1619 -0.3498 -0.1805 0.1355 0.1087 -0.1865 0.0989 0.1441 0.0251 0.2000 -0.0565 0.2435 0.2371 0.2337 -0.2416 -0.2894 0.2589 0.2455
va: 3.1723 1.0475 3.8850 1.0141 4.3339 2.1697 4.0853 3.9201 2.0489 3.1191 1.0051 4.0013 1.0250 1.0011 1.0018 2.2306 1.0150 1.0071 2.1653 1.0235 4.3875 2.1669 3.8325 1.0060 1.0429 3.9849 1.0087 1.0174 3.6833 1.0316 3.6626 0.9850 0.9721 4.3758 2.2230 2.2019 1.0076 0.9664
dispcorr: -0.080221702 hartree
energy: -1406.303484618050
dipole: 13.09740 -7.79988 5.29752 -5.33923 4.30622 -1.03301 3.18991 -4.76982 -1.57991
magnitude: 5.62379 au
magnitude: 14.29453 debye
zeropoint: 0.31029913 hartree
thermalvibcorrection: 0.01916882 hartree
thermalrotcorrection: 0.00141627 hartree
thermaltrasncorrection: 0.00141627 hartree
thermaltotal: -1405.97118412 hartree
thermalcorr: 0.02200137 hartree
nonthermalcorr: 0.31029913 hartree
totalcorr: 0.33230049 hartree
totalenthalpy: -1405.97023992 hartree
