program: Orca
programVersion: 5.0.2
elementType: N H C H C O C C O N H C H H H O H H S H C O C H H C H H C H N H H C O O H H
charge: 1
multiplicity: 1
keywords: wB97X-D3BJ Opt Freq def2-TZVPP def2/J RIJCOSX VeryTightSCF
keywords: PAL8 defgrid3 TightOpt
frequency: 0.00 0.00 0.00 0.00 0.00 0.00 24.53 28.28 36.86 44.44 50.84 70.53 75.53 92.41 108.39 112.48 151.81 164.47 188.38 202.74 212.79 244.51 260.49 281.41 305.83 313.93 335.59 359.15 367.43 386.61 396.91 431.85 495.65 510.61 514.64 542.12 590.54 592.88 621.98 651.67 656.78 666.70 697.86 712.89 729.78 747.95 766.68 791.63 843.66 853.98 863.55 885.01 908.14 931.03 956.63 979.41 996.83 1046.95 1060.01 1081.77 1122.57 1131.02 1151.80 1171.29 1189.85 1193.73 1213.14 1218.83 1254.11 1284.51 1292.26 1297.26 1316.74 1335.81 1339.63 1359.89 1366.15 1383.96 1409.61 1425.20 1447.41 1455.11 1463.92 1464.80 1487.96 1493.88 1500.26 1509.98 1539.13 1607.78 1646.29 1683.93 1717.15 1772.11 1838.78 1851.71 2652.07 2763.46 3077.57 3093.60 3095.07 3111.87 3116.68 3129.10 3168.80 3172.58 3190.77 3200.01 3503.38 3558.63 3563.11 3633.80 3789.08 3807.00
frequency: 24.53 28.28 36.86 44.44 50.84 70.53 75.53 92.41 108.39 112.48 151.81 164.47 188.38 202.74 212.79 244.51 260.49 281.41 305.83 313.93 335.59 359.15 367.43 386.61 396.91 431.85 495.65 510.61 514.64 542.12 590.54 592.88 621.98 651.67 656.78 666.70 697.86 712.89 729.78 747.95 766.68 791.63 843.66 853.98 863.55 885.01 908.14 931.03 956.63 979.41 996.83 1046.95 1060.01 1081.77 1122.57 1131.02 1151.80 1171.29 1189.85 1193.73 1213.14 1218.83 1254.11 1284.51 1292.26 1297.26 1316.74 1335.81 1339.63 1359.89 1366.15 1383.96 1409.61 1425.20 1447.41 1455.11 1463.92 1464.80 1487.96 1493.88 1500.26 1509.98 1539.13 1607.78 1646.29 1683.93 1717.15 1772.11 1838.78 1851.71 2652.07 2763.46 3077.57 3093.60 3095.07 3111.87 3116.68 3129.10 3168.80 3172.58 3190.77 3200.01 3503.38 3558.63 3563.11 3633.80 3789.08 3807.00
formula: C10H18N3O6S
InChI: InChI=1S/C10H18N3O6S/c11-5(10(18)19)1-2-7(14)13-6(4-20)9(17)12-3-8(15)16/h5-6,12-13,15,18,20H,1-4H2,11H3
38 atoms
N  -1.08204 -2.722576 2.309147
H  -1.820453 -3.102074 1.731999
C  -0.527273 -3.544264 3.3532
H  -0.181347 -2.928946 4.184464
C  0.653656 -4.356066 2.842134
O  1.1110 -4.284148 1.729514
C  -0.368245 -1.685668 1.830883
C  -0.866686 -1.098895 0.493288
O  0.609819 -1.227981 2.398701
N  0.007523 -0.019146 0.072252
H  -1.830556 -0.623334 0.692591
C  -1.085969 -2.174368 -0.593101
H  -0.370713 0.914627 0.128464
H  -0.938511 -1.716627 -1.569224
H  -0.392313 -3.004705 -0.472534
O  1.127866 -5.164197 3.793754
H  1.861997 -5.672825 3.424346
H  -1.287889 -4.223282 3.737491
S  -2.784237 -2.808284 -0.462469
H  -2.584075 -3.958953 -1.11376
C  1.34927 -0.025888 0.014214
O  1.95125 1.058435 -0.044123
C  2.12493 -1.322603 -0.113594
H  1.467483 -2.183117 -0.186649
H  2.631286 -1.231179 -1.078289
C  3.156939 -1.630892 0.997877
H  4.012691 -2.14213 0.54724
H  2.707495 -2.325483 1.701442
C  3.652287 -0.450752 1.827397
H  2.806149 0.005671 2.345018
N  4.263257 0.603659 0.964993
H  5.016657 0.220421 0.397233
H  3.452311 0.962039 0.364156
C  4.701721 -0.852223 2.851398
O  5.797745 -0.357765 2.880436
O  4.25666 -1.784575 3.688216
H  4.95799 -1.982724 4.325294
H  4.672072 1.34511 1.531682
totalener: -1406.24674453 hartree
nucrepener: 1890.45864363 hartree
electener: -3296.70538816 hartree
oneelecener: -5665.39916289 hartree
twoeener: 2368.69377474 hartree
kineticenergy: 1400.66959816 hartree
exchangeener: -105.328147555005 hartree
correlationener: -7.056214656144 hartree
xcener: -112.384362211148 hartree
temp: 298.15 k
press: 1.00 atm
thermalcorrenthalpy: 0.00094421 hartree
totalenthalpy: -1405.99948726 hartree
totalentropycorr: -0.06554703 hartree
gibbsenthalpy: -1406.06503428 hartree
gibbsminuselec: 0.26356487 hartree
chargesum: 1.0000000
charge: -0.184292 0.174803 -0.069880 0.134676 0.308402 -0.348538 0.246514 0.056727 -0.409304 -0.160778 0.135133 -0.205510 0.190705 0.135366 0.135002 -0.251302 0.237411 0.146193 -0.137903 0.125104 0.282071 -0.402851 -0.200422 0.104735 0.152739 -0.190714 0.139657 0.125428 -0.035853 0.172377 -0.051356 0.214806 0.223228 0.271192 -0.295112 -0.242810 0.247482 0.226876
charge: 0.337663 -0.057218 -0.039517 0.042749 -0.433333 0.099116 -0.375985 -0.132181 0.093443 0.356866 0.040854 -0.228066 0.000130 0.006284 0.001267 0.381244 -0.081911 0.040638 0.516182 -0.139852 -0.333833 0.129097 0.006388 0.030888 0.040045 0.001214 0.032011 0.035680 -0.061194 0.049336 0.602178 0.042524 -0.062560 -0.437898 0.126700 0.395883 -0.068724 0.043892
qa: -0.1843 0.1748 -0.0699 0.1347 0.3084 -0.3485 0.2465 0.0567 -0.4093 -0.1608 0.1351 -0.2055 0.1907 0.1354 0.1350 -0.2513 0.2374 0.1462 -0.1379 0.1251 0.2821 -0.4029 -0.2004 0.1047 0.1527 -0.1907 0.1397 0.1254 -0.0359 0.1724 -0.0514 0.2148 0.2232 0.2712 -0.2951 -0.2428 0.2475 0.2269
va: 3.1960 1.0721 3.8186 1.0168 4.2718 2.1261 4.2331 3.8144 2.0935 3.2117 0.9966 3.9775 1.0153 1.0049 1.0063 2.2421 1.0191 1.0064 2.1962 1.0172 4.2122 2.1152 3.8549 1.0333 1.0065 3.8386 1.0013 1.0507 3.7979 1.0142 3.6128 0.9930 1.0951 4.4221 2.2059 2.2471 1.0097 0.9864
dispcorr: -0.082241175 hartree
energy: -1406.334187361456
dipole: 2.58850 -1.21933 1.36918 0.23990 0.03061 0.27051 -4.89293 4.48919 -0.40374
magnitude: 1.45287 au
magnitude: 3.69290 debye
zeropoint: 0.31099190 hartree
thermalvibcorrection: 0.01840898 hartree
thermalrotcorrection: 0.00141627 hartree
thermaltrasncorrection: 0.00141627 hartree
thermaltotal: -1406.00195394 hartree
thermalcorr: 0.02124153 hartree
nonthermalcorr: 0.31099190 hartree
totalcorr: 0.33223343 hartree
totalenthalpy: -1406.00100973 hartree
