program: Orca
programVersion: 5.0.2
elementType: N H C H C O C C O N H C H H H O H H S H C O C H H C H H C H N H H C O O H H
charge: 1
multiplicity: 1
keywords: wB97X-D3BJ Opt Freq def2-TZVPP def2/J RIJCOSX VeryTightSCF
keywords: PAL8 defgrid3 TightOpt
frequency: 0.00 0.00 0.00 0.00 0.00 0.00 14.92 22.19 31.73 34.49 52.17 65.17 75.97 81.35 84.24 97.58 147.27 154.01 163.38 179.79 213.21 225.87 240.68 261.57 274.28 304.11 323.42 325.94 373.18 399.60 429.12 449.50 483.46 507.64 527.83 536.01 592.73 605.78 629.91 652.66 665.51 674.68 691.92 714.21 737.89 744.27 793.49 803.91 836.12 860.90 869.85 900.44 914.10 931.31 946.01 958.21 1018.63 1034.75 1070.03 1085.40 1114.63 1115.67 1142.00 1147.43 1181.49 1212.26 1237.17 1243.77 1259.75 1283.91 1302.53 1305.07 1323.54 1326.18 1356.94 1357.76 1375.70 1383.08 1390.74 1410.96 1428.50 1459.46 1463.33 1474.71 1483.34 1490.53 1501.83 1522.50 1547.11 1579.50 1656.62 1667.24 1723.08 1763.01 1856.88 1889.70 2524.80 2767.09 3071.44 3085.78 3093.45 3106.51 3113.18 3131.99 3139.96 3147.57 3170.64 3190.38 3422.20 3548.44 3589.88 3660.00 3677.94 3780.31
frequency: 14.92 22.19 31.73 34.49 52.17 65.17 75.97 81.35 84.24 97.58 147.27 154.01 163.38 179.79 213.21 225.87 240.68 261.57 274.28 304.11 323.42 325.94 373.18 399.60 429.12 449.50 483.46 507.64 527.83 536.01 592.73 605.78 629.91 652.66 665.51 674.68 691.92 714.21 737.89 744.27 793.49 803.91 836.12 860.90 869.85 900.44 914.10 931.31 946.01 958.21 1018.63 1034.75 1070.03 1085.40 1114.63 1115.67 1142.00 1147.43 1181.49 1212.26 1237.17 1243.77 1259.75 1283.91 1302.53 1305.07 1323.54 1326.18 1356.94 1357.76 1375.70 1383.08 1390.74 1410.96 1428.50 1459.46 1463.33 1474.71 1483.34 1490.53 1501.83 1522.50 1547.11 1579.50 1656.62 1667.24 1723.08 1763.01 1856.88 1889.70 2524.80 2767.09 3071.44 3085.78 3093.45 3106.51 3113.18 3131.99 3139.96 3147.57 3170.64 3190.38 3422.20 3548.44 3589.88 3660.00 3677.94 3780.31
formula: C10H18N3O6S
InChI: InChI=1S/C10H18N3O6S/c11-5(10(18)19)1-2-7(14)13-6(4-20)9(17)12-3-8(15)16/h5-6,12-13,15,18,20H,1-4H2,11H3
38 atoms
N  -0.734572 -1.487583 -2.384718
H  -0.596413 -0.492738 -2.433775
C  -0.949569 -2.223529 -3.627183
H  -0.477132 -1.68205 -4.442154
C  -2.440648 -2.366954 -3.958563
O  -2.938293 -1.833909 -4.905995
C  -0.932393 -2.062663 -1.184576
C  -0.792595 -1.17353 0.054413
O  -1.243921 -3.236102 -1.042663
N  0.049595 -0.000257 -0.146103
H  -0.37825 -1.809578 0.839065
C  -2.197676 -0.737721 0.475656
H  -0.384482 0.908134 -0.040144
H  -2.660375 -0.151156 -0.320448
H  -2.791061 -1.634472 0.641051
O  -3.14775 -3.113192 -3.099785
H  -2.575234 -3.469398 -2.399775
H  -0.491269 -3.209525 -3.530434
S  -2.074412 0.248087 1.993553
H  -3.360742 0.608258 2.046264
C  1.38862 0.017111 -0.172984
O  1.990234 1.098474 -0.24911
C  2.120104 -1.308332 -0.093806
H  2.059899 -1.657337 0.943075
H  1.583468 -2.051316 -0.685074
C  3.575722 -1.283845 -0.571905
H  3.64471 -0.821927 -1.560924
H  3.897177 -2.319494 -0.687372
C  4.592992 -0.615594 0.364142
H  4.432442 -0.935087 1.394514
N  4.494748 0.871867 0.298457
H  4.767938 1.313795 1.173267
H  5.150276 1.197484 -0.419852
C  6.017207 -0.968765 -0.061215
O  6.739323 -0.171124 -0.596944
O  6.313239 -2.231722 0.21074
H  7.212209 -2.423931 -0.09483
H  3.475834 1.120417 0.051349
totalener: -1406.23485824 hartree
nucrepener: 1761.55103281 hartree
electener: -3167.78589105 hartree
oneelecener: -5406.07613384 hartree
twoeener: 2238.29024279 hartree
kineticenergy: 1400.62452725 hartree
exchangeener: -105.318408126126 hartree
correlationener: -7.051267012128 hartree
xcener: -112.369675138254 hartree
temp: 298.15 k
press: 1.00 atm
thermalcorrenthalpy: 0.00094421 hartree
totalenthalpy: -1405.98357925 hartree
totalentropycorr: -0.06660640 hartree
gibbsenthalpy: -1406.05018565 hartree
gibbsminuselec: 0.26153856 hartree
chargesum: 1.0000000
charge: -0.189746 0.191237 -0.131073 0.130439 0.264865 -0.267497 0.188720 0.045494 -0.371019 -0.197242 0.146778 -0.203029 0.207371 0.133269 0.150553 -0.237185 0.230512 0.143062 -0.148917 0.128952 0.272578 -0.384361 -0.176586 0.123803 0.146323 -0.249710 0.137414 0.147269 0.021127 0.144042 -0.077677 0.223892 0.223179 0.281407 -0.287981 -0.242644 0.260439 0.221940
charge: 0.333523 -0.023318 -0.033694 0.033808 -0.455039 0.143212 -0.402232 -0.142832 0.106015 0.348633 0.041718 -0.221952 -0.004995 0.009175 0.020479 0.375264 -0.132313 0.031486 0.480207 -0.136199 -0.333474 0.153116 -0.001147 0.044310 0.045992 0.006065 0.039726 0.046233 -0.052592 0.043826 0.598426 0.040567 0.034426 -0.439502 0.143311 0.401832 -0.060634 -0.081427
qa: -0.1897 0.1912 -0.1311 0.1304 0.2649 -0.2675 0.1887 0.0455 -0.3710 -0.1972 0.1468 -0.2030 0.2074 0.1333 0.1506 -0.2372 0.2305 0.1431 -0.1489 0.1290 0.2726 -0.3844 -0.1766 0.1238 0.1463 -0.2497 0.1374 0.1473 0.0211 0.1440 -0.0777 0.2239 0.2232 0.2814 -0.2880 -0.2426 0.2604 0.2219
va: 3.1468 1.0128 3.8297 1.0107 4.3632 2.2309 4.2651 3.7363 2.1544 3.1713 1.0109 4.0175 1.0194 0.9999 1.0096 2.2101 1.0488 0.9994 2.1658 1.0193 4.2016 2.1285 3.7876 1.0048 1.0065 3.9215 1.0067 1.0153 3.8363 1.0085 3.5606 0.9828 1.0105 4.3678 2.2007 2.2713 0.9997 1.1056
dispcorr: -0.077435750 hartree
energy: -1406.317681659953
dipole: 7.13782 -2.01814 5.11968 1.18916 0.20495 1.39411 3.90501 -1.39735 2.50766
magnitude: 5.86882 au
magnitude: 14.91735 debye
zeropoint: 0.30985784 hartree
thermalvibcorrection: 0.01877463 hartree
thermalrotcorrection: 0.00141627 hartree
thermaltrasncorrection: 0.00141627 hartree
thermaltotal: -1405.98621665 hartree
thermalcorr: 0.02160717 hartree
nonthermalcorr: 0.30985784 hartree
totalcorr: 0.33146501 hartree
totalenthalpy: -1405.98527244 hartree
